[Top][All Lists]

[Date Prev][Date Next][Thread Prev][Thread Next][Date Index][Thread Index]

XFAIL: txinfo5.test

From: Thomas J. Duck
Subject: XFAIL: txinfo5.test
Date: Wed, 3 Dec 2008 21:49:14 -0400

I have installed automake1.9.6 on my Mac OS X 10.4 system. 'Make check' results in the error below. If there is any further information you need, please let me know. --Tom

XFAIL: txinfo5.test
PASS: yaccvpath.test
1 of 527 tests failed
(40 tests were not run)
Please report to address@hidden
make[2]: *** [check-TESTS] Error 1
make[1]: *** [check-am] Error 2
make: *** [check-recursive] Error 1


Thomas J. Duck <address@hidden>

Associate Professor,
Department of Physics and Atmospheric Science, Dalhousie University,
Halifax, Nova Scotia, Canada, B3H 3J5.
Tel: (902)494-1456 | Fax: (902)494-5191 | Lab: (902)494-3813
Web: http://aolab.phys.dal.ca/

reply via email to

[Prev in Thread] Current Thread [Next in Thread]