[Top][All Lists]

[Date Prev][Date Next][Thread Prev][Thread Next][Date Index][Thread Index]

error report while installing bisonee

From: Naidu, Venkata
Subject: error report while installing bisonee
Date: Mon, 2 Jan 2006 14:53:34 +0530


Hello sir,

  While I was trying to install ( configure + make ) bison

I got the following error.

Please suggest me some solution to it..

At present am using HP-UX   PA-RISC2.0



/lib -I/usr/local/include   -g -c reader.c

source='reduce.c' object='reduce.o' libtool=no \

DEPDIR=.deps depmode=hp /bin/sh ../build-aux/depcomp \

cc -DHAVE_CONFIG_H -DPKGDATADIR=\"/usr/local/share/bison\"
-DLOCALEDIR=\"/usr/local/share/locale\" -I. -I. -I..  -I../lib -I../lib
-I/usr/local/include   -g -c reduce.c

cc: error 1405: "/opt/ansic/lbin/ccom" terminated abnormally with signal

make[3]: *** [reduce.o] Error 9

make[3]: Leaving directory `/home/CAI/tsbld/ENVIRONMENT/bison-2.1/src'

make[2]: *** [all] Error 2

make[2]: Leaving directory `/home/CAI/tsbld/ENVIRONMENT/bison-2.1/src'

make[1]: *** [all-recursive] Error 1

make[1]: Leaving directory `/home/CAI/tsbld/ENVIRONMENT/bison-2.1'

make: *** [all] Error 2




Please give some relevant solution 


 Thanking you

Venkata naidu

reply via email to

[Prev in Thread] Current Thread [Next in Thread]