[Top][All Lists]

[Date Prev][Date Next][Thread Prev][Thread Next][Date Index][Thread Index]

Coreutils Errors

From: Steven Hepting
Subject: Coreutils Errors
Date: Wed, 14 Apr 2004 12:34:08 -0600

I tried installing coreutils for a project at http://www.macosxhints.com/article.php?story=20040410043824914 (I've never really installed much using just the Terminal). I'm running Mac OS 10.3.3 on a 12inch Powerbook G4. I don't know what else you might need to know but I've include some of the output from the "make check"
Steven Hepting

Making check in chgrp
make  check-TESTS
PASS: no-x
chgrp: changing group of `2/2s': Function not implemented
FAIL: posix-H
expected actual differ: char 392, line 15
> neither symbolic link `symlink' nor referent has been changed
< changed group of `symlink' to G1
FAIL: basic
./deref: skipping this test; your system doesn't support changing
the owner or group of a symbolic link.
SKIP: deref
chgrp: changing group of `d/s': Function not implemented
PASS: recurse
2 of 4 tests failed
(1 tests were not run)
Please report to address@hidden
make[3]: *** [check-TESTS] Error 1
make[2]: *** [check-am] Error 2
make[1]: *** [check-recursive] Error 1
make: *** [check-recursive] Error 1

reply via email to

[Prev in Thread] Current Thread [Next in Thread]