[Top][All Lists]

[Date Prev][Date Next][Thread Prev][Thread Next][Date Index][Thread Index]

bug#11164: reporting of bugs in lfs

From: vr tech labs
Subject: bug#11164: reporting of bugs in lfs
Date: Tue, 3 Apr 2012 21:22:24 +0530

i am getting the bug while running   the following command
"make RUN_EXPENSIVE_TESTS=yes check"
the error is
See tests/test-suite.log
Please report to address@hidden
make[4]: *** [test-suite.log] Error 1
make[4]: Leaving directory `/mnt/lfs/sources/coreutils-8.15/tests'
make[3]: *** [check-TESTS] Error 2
make[3]: Leaving directory `/mnt/lfs/sources/coreutils-8.15/tests'
make[2]: *** [check-am] Error 2
make[2]: Leaving directory `/mnt/lfs/sources/coreutils-8.15/tests'
make[1]: *** [check-recursive] Error 1
make[1]: Leaving directory `/mnt/lfs/sources/coreutils-8.15'
make: *** [check] Error 2

reply via email to

[Prev in Thread] Current Thread [Next in Thread]