[Top][All Lists]

[Date Prev][Date Next][Thread Prev][Thread Next][Date Index][Thread Index]

bug#10780: 24.0.93 fails to build with 'Invalid function: "DEAD"'

From: Dan Horák
Subject: bug#10780: 24.0.93 fails to build with 'Invalid function: "DEAD"'
Date: Fri, 10 Feb 2012 16:51:46 +0100


emacs 24.0.93 (and 24.0.92) fails to build on ppc and s390 (32-bit
big-endians) with

make[3]: Entering directory
cd /builddir/build/BUILD/emacs-24.0.93/lisp; subdirs=`(find . -type d -print)`; 
for file in $subdirs; do case $file in */.* | */.*/* | */=* | */cedet* ) ;; *) 
wins="$wins $file" ;; esac; done; \
for file in $wins; do \
   /builddir/build/BUILD/emacs-24.0.93/update-subdirs $file; \
make[3]: Leaving directory `/builddir/build/BUILD/emacs-24.0.93/build-gtk/lisp'
if test "no" = "yes"; then \
  ln -f temacs bootstrap-emacs; \
else \
  `/bin/pwd`/temacs --batch --load loadup bootstrap || exit 1; \
  mv -f emacs bootstrap-emacs; \
Loading loadup.el (source)...
Using load-path (/builddir/build/BUILD/emacs-24.0.93/lisp 
Loading emacs-lisp/byte-run (source)...
Loading emacs-lisp/backquote (source)...
Loading subr (source)...
Invalid function: "DEAD"
make[2]: Leaving directory `/builddir/build/BUILD/emacs-24.0.93/build-gtk/src'
make[2]: *** [bootstrap-emacs] Error 1
make[1]: Leaving directory `/builddir/build/BUILD/emacs-24.0.93/build-gtk'
make[1]: *** [src] Error 2
make: *** [bootstrap] Error 2
RPM build errors:
error: Bad exit status from /var/tmp/rpm-tmp.SbWTXU (%build)
    Bad exit status from /var/tmp/rpm-tmp.SbWTXU (%build)
Child returncode was: 1
EXCEPTION: Command failed. See logs for output.

Build environment was Fedora 17 with gcc 4.7, but also fails on RHEL-6.
Builds on ppc64 and s390x were successful.

reply via email to

[Prev in Thread] Current Thread [Next in Thread]