[Top][All Lists]

[Date Prev][Date Next][Thread Prev][Thread Next][Date Index][Thread Index]

Re: [Bug-gnubg] gnubg compile failure

From: Jonathan Kinsey
Subject: Re: [Bug-gnubg] gnubg compile failure
Date: Tue, 30 Dec 2008 21:26:00 +0000

Zulli, Louis P wrote:
> Hi,
> I attempted to compile the latest snapshot. Ran into
> util.c: In function ‘TEMP_g_mkstemp’:
> util.c:130: error: ‘O_BINARY’ undeclared (first use in this function)
> util.c:130: error: (Each undeclared identifier is reported only once
> util.c:130: error: for each function it appears in.)
> make[2]: *** [util.o] Error 1
> make[1]: *** [all-recursive] Error 1
> make: *** [all] Error 2
> Any thoughts?

This is in the temporary code I put in to get around a problem with glib on
windows, I've put it into a win32 block so this problem will go away for you.


Get Windows Live Messenger on your Mobile. Click Here!

reply via email to

[Prev in Thread] Current Thread [Next in Thread]