bug-gnustep
[Top][All Lists]
Advanced

[Date Prev][Date Next][Thread Prev][Thread Next][Date Index][Thread Index]

recent gstep-core doesn't compile.


From: Andreas Fuchs
Subject: recent gstep-core doesn't compile.
Date: Wed, 15 Nov 2000 11:35:11 +0100 (CET)

Hi,
the recent CVS gstep core does not compile correctly. I used the rules
script in the debian directory of the tree (I use debian woody); no
configure script complained about missing libs.

This is the error message that I get:
----cut-----
Making all for svc example...
Uncaught exception NSInvalidArgumentException, reason: No resource name 
specified.
make[4]: *** [before-example-all] Error 134
make[3]: *** [example.build] Error 2
make[2]: *** [example.all.svc.variables] Error 2
make[2]: Leaving directory `/home/asf/dl/cvs/gstep/core/gui/Tools'
make[1]: *** [internal-all] Error 2
make[1]: Leaving directory `/home/asf/dl/cvs/gstep/core/gui'
make: *** [subproj-all] Error 2
----cut-----

I also tried building without the rules script and the build failed
again.

When replying to this message, please Cc: me as I'm not subscribed to
this list.

Thanks,
-- 
Andreas Fuchs, <address@hidden>, <address@hidden>, antifuchs



reply via email to

[Prev in Thread] Current Thread [Next in Thread]