[Top][All Lists]

[Date Prev][Date Next][Thread Prev][Thread Next][Date Index][Thread Index]

[bugs #9188] Problem compiling gnustep-gui 0.9.2

From: Pierre
Subject: [bugs #9188] Problem compiling gnustep-gui 0.9.2
Date: Wed, 02 Jun 2004 10:36:41 -0400
User-agent: Mozilla/5.0 (X11; U; Linux i686; en-US; rv:1.7) Gecko/20040514

This mail is an automated notification from the bugs tracker
 of the project: GNUstep.

[bugs #9188] Full Item Snapshot:

URL: <http://savannah.gnu.org/bugs/?func=detailitem&item_id=9188>
Project: GNUstep
Submitted by: Pierre
On: mer 02.06.2004 à 14:33

Category:  Gui/AppKit
Severity:  5 - Average
Item Group:  Installation
Resolution:  None
Assigned to:  None
Status:  Open

Summary:  Problem compiling gnustep-gui 0.9.2

Original Submission:  # gmake
Making all in Source...
gmake[1]: Entering directory `/tmp/gnustep-gui-0.9.2/Source'
Making all for library libgnustep-gui...
 Compiling file Functions.m ...
Functions.m:29:42: Foundation/NSAutoreleasePool.h: No such file or directory
Functions.m:30:33: Foundation/NSBundle.h: No such file or directory
Functions.m:31:38: Foundation/NSProcessInfo.h: No such file or directory
In file included from ../Headers/AppKit/NSApplication.h:41,
                 from Functions.m:33:
../Headers/AppKit/NSResponder.h:32:33: Foundation/NSObject.h: No such file or 
In file included from ../Headers/AppKit/NSApplication.h:41,
                 from Functions.m:33:
../Headers/AppKit/NSResponder.h:42: error: cannot find protocol declaration for 
../Headers/AppKit/NSResponder.h:81: error: cannot find interface declaration 
for `NSObject', superclass of `NSResponder'
gmake[2]: *** [shared_obj/Functions.o] Error 1
gmake[1]: *** [libgnustep-gui.all.library.variables] Error 2
gmake[1]: Leaving directory `/tmp/gnustep-gui-0.9.2/Source'
gmake: *** [internal-all] Error 2

For detailed info, follow this link:

  Message sent via/by Savannah

reply via email to

[Prev in Thread] Current Thread [Next in Thread]