bug-gnustep
[Top][All Lists]
Advanced

[Date Prev][Date Next][Thread Prev][Thread Next][Date Index][Thread Index]

Installation failed!!!


From: Vipin Singh
Subject: Installation failed!!!
Date: Thu, 5 Apr 2012 19:46:06 +0530

Hi,

While installing objective C I got failed message. Please find the attached log for the same.
Few Ending lines with Error prompt:

compilation terminated.
gmake[6]: *** [obj/x11.obj/XGServerWindow.m.o] Error 1
gmake[5]: *** [internal-subproject-all_] Error 2
gmake[4]: *** [x11.all.subproject.variables] Error 2
gmake[3]: *** [libgnustep-back-020.all.bundle.variables] Error 2
gmake[2]: *** [internal-all] Error 2
gmake[1]: *** [internal-all] Error 2
gmake[1]: Leaving directory `/home/vipin/Downloads/gnustep-startup-0.26.2/build/gnustep-back-0.20.1'
gmake[4]: *** [x11.all.subproject.variables] Error 2
gmake[3]: *** [libgnustep-back-020.all.bundle.variables] Error 2
gmake[2]: *** [internal-all] Error 2
gmake[1]: *** [internal-all] Error 2

---------------------------------------------------------
Installation of GNUstep Back failed. Send the /home/vipin/Downloads/gnustep-startup-0.26.2/build/logs.tar.gz
file to address@hidden for help
---------------------------------------------------------
make: *** [all] Error 1

Please help me out.

--
Thanks & Regards,
Vipin Singh
+91-8147915298


Attachment: logs.tar.gz
Description: GNU Zip compressed data


reply via email to

[Prev in Thread] Current Thread [Next in Thread]