[Top][All Lists]

[Date Prev][Date Next][Thread Prev][Thread Next][Date Index][Thread Index]

[bug-mailutils] Build problems

From: Linus Nordberg
Subject: [bug-mailutils] Build problems
Date: Wed, 24 Sep 2003 21:54:06 +0200
User-agent: Gnus/5.090008 (Oort Gnus v0.08) Emacs/21.2 (i386--freebsd)


CVS as of yesterday.

fluff:mailutils% uname -a
FreeBSD fluff 4.7-RELEASE FreeBSD 4.7-RELEASE #6: Tue Jul 15 22:29:26 CEST 2003 
    address@hidden:/usr/src/sys/compile/FLUFF  i386

fluff:mailutils% gcc --version

Making all in auth
gmake[2]: Entering directory `/usr/home/u/anon-cvs/mailutils/auth'
source='lbuf.c' object='lbuf.lo' libtool=yes \
depfile='.deps/lbuf.Plo' tmpdepfile='.deps/lbuf.TPlo' \
depmode=gcc /usr/local/bin/bash ../scripts/depcomp \
/usr/local/bin/bash ../libtool --mode=compile gcc -DHAVE_CONFIG_H -I. -I. -I.. 
-I../include -I../mailbox/include -I../lib -I../include/mailutils/gnu   
-I/usr/local/include -DSYSCONFDIR=\"/usr/local/etc\" 
-DSITE_CRAM_MD5_PWD=\"/usr/local/etc/cram-md5.pwd\" -g -O2 -c -o lbuf.lo `test 
-f 'lbuf.c' || echo './'`lbuf.c
 gcc -DHAVE_CONFIG_H -I. -I. -I.. -I../include -I../mailbox/include -I../lib 
-I../include/mailutils/gnu -I/usr/local/include -DSYSCONFDIR=\"/usr/local/etc\" 
-DSITE_CRAM_MD5_PWD=\"/usr/local/etc/cram-md5.pwd\" -g -O2 -c lbuf.c 
-Wp,-MD,.deps/lbuf.TPlo  -fPIC -DPIC -o .libs/lbuf.o
In file included from lbuf.c:24:
lbuf.h:29: syntax error before `off_t'
lbuf.c: In function `_auth_lb_read':
lbuf.c:92: warning: passing arg 1 of `memcpy' discards qualifiers from pointer 
target type
lbuf.c: At top level:
lbuf.c:116: syntax error before `off_t'
lbuf.c:117: `_auth_lb_writelines' declared as function returning a function
lbuf.c:118: syntax error before `void'
gmake[2]: *** [lbuf.lo] Error 1
gmake[2]: Leaving directory `/usr/home/u/anon-cvs/mailutils/auth'
gmake[1]: *** [all-recursive] Error 1
gmake[1]: Leaving directory `/usr/home/u/anon-cvs/mailutils'
gmake: *** [all] Error 2


reply via email to

[Prev in Thread] Current Thread [Next in Thread]