[Top][All Lists]

[Date Prev][Date Next][Thread Prev][Thread Next][Date Index][Thread Index]

[bug-mailutils] Re: Mailutils-3 - build problem?

From: Kamil Jońca
Subject: [bug-mailutils] Re: Mailutils-3 - build problem?
Date: Thu, 03 Mar 2011 21:44:11 +0100
User-agent: Gnus/5.13 (Gnus v5.13) Emacs/23.2 (gnu/linux)

Sergey Poznyakoff <address@hidden> writes:

> Kamil Jońca <address@hidden> ha escrit:
>> I got mailutils directory *without* INSTALL file, or ./configure scripts

Afetr  bootstraping I've got error about AM_GNU_RADIUS (I have
commented it out for a while)
Then I've got, in doc/texinfo dir  a lot of errors like:
--8<---------------cut here---------------start------------->8---
make: *** No rule to make target `url-parse.inc', needed by `mailutils.info'.  
--8<---------------cut here---------------end--------------->8---

after executing (in doc/texinfo dir)[1]
--8<---------------cut here---------------start------------->8---
sed -f ../../mu-aux/texify.sed ../../examples/addr.c > addr.inc
sed -f ../../mu-aux/texify.sed ../../examples/http.c > http.inc
sed -f ../../mu-aux/texify.sed ../../examples/mailcap.c > mailcap.inc
sed -f ../../mu-aux/texify.sed ../../examples/cpp/mailcap.c > mailcap.inc
sed -f ../../mu-aux/texify.sed ../../examples/cpp/mailcap.cc > mailcap.inc
sed -f ../../mu-aux/texify.sed ../../examples/numaddr.c > numaddr.inc
sed -f ../../mu-aux/texify.sed ../../examples/sfrom.c > sfrom.inc
sed -f ../../mu-aux/texify.sed ../../examples/cpp/url-parse.cc > url-parse.inc
--8<---------------cut here---------------end--------------->8---

I've got 
--8<---------------cut here---------------start------------->8---
make[3]: Entering directory `/home/kjonca/tmp/mu/mailutils/mu'
  CC     shell.o
shell.c: In function ‘readline’:
shell.c:428: error: ‘n’ undeclared (first use in this function)
shell.c:428: error: (Each undeclared identifier is reported only once
shell.c:428: error: for each function it appears in.)
shell.c: In function ‘mutool_shell’:
shell.c:563: error: expected ‘)’ before ‘name’
shell.c:563: warning: statement with no effect
make[3]: *** [shell.o] Error 1
make[3]: Leaving directory `/home/kjonca/tmp/mu/mailutils/mu'
make[2]: *** [all] Error 2
make[2]: Leaving directory `/home/kjonca/tmp/mu/mailutils/mu'
make[1]: *** [all-recursive] Error 1
make[1]: Leaving directory `/home/kjonca/tmp/mu/mailutils'
--8<---------------cut here---------------end--------------->8---
and gave up :(
Am I do something completely wrong? 


[1] http://lists.gnu.org/archive/html/bug-mailutils/2006-10/msg00006.html
as inspiration.

Spokojnie... To tylko prowokacja.

reply via email to

[Prev in Thread] Current Thread [Next in Thread]