[Top][All Lists]

[Date Prev][Date Next][Thread Prev][Thread Next][Date Index][Thread Index]

[Discuss-gnuradio] Error in build

From: Robert W. McGwier
Subject: [Discuss-gnuradio] Error in build
Date: Tue, 01 Mar 2005 10:29:57 -0500
User-agent: Mozilla Thunderbird 0.8 (X11/20040913)

What is this about?  rebuilding gnuradio-core after a checkout:

I cannot see an error in the file with emacs

In file included from /usr/include/g++/algorithm:69,
                from /usr/include/boost/shared_ptr.hpp:31,
                from gr_types.h:26,
                from gr_runtime.h:26,
                from gr_block.h:26,
                from gr_block.cc:27:
/usr/include/g++/bits/stl_algo.h: In function `_BidirectionalIter3
  std::__merge_backward(_BidirectionalIter1, _BidirectionalIter1,
  _BidirectionalIter2, _BidirectionalIter2, _BidirectionalIter3)':
/usr/include/g++/bits/stl_algo.h:3346: error: stray '\240' in program
make[4]: *** [gr_block.lo] Error 1
make[4]: Leaving directory `/usr/local/GnuRadio/gr-build/gnuradio-core/src/lib/runtime'
make[3]: *** [all-recursive] Error 1
make[3]: Leaving directory `/usr/local/GnuRadio/gr-build/gnuradio-core/src/lib'
make[2]: *** [all-recursive] Error 1
make[2]: Leaving directory `/usr/local/GnuRadio/gr-build/gnuradio-core/src'
make[1]: *** [all-recursive] Error 1
make[1]: Leaving directory `/usr/local/GnuRadio/gr-build/gnuradio-core'
make: *** [all] Error 2

reply via email to

[Prev in Thread] Current Thread [Next in Thread]