discuss-gnustep
[Top][All Lists]
Advanced

[Date Prev][Date Next][Thread Prev][Thread Next][Date Index][Thread Index]

Re: Compilation of snapshot failed (31.12.)


From: Sungjin Chun
Subject: Re: Compilation of snapshot failed (31.12.)
Date: Mon, 1 Jan 2001 02:00:53 +0900

Hi,

Base needs GMP package, right?

----- Original Message -----
From: "Philippe C.D.Robert" <address@hidden>
To: "GNUstep discuss" <address@hidden>; "Bugs GNUstep"
<address@hidden>
Sent: Sunday, December 31, 2000 10:58 PM
Subject: Compilation of snapshot failed (31.12.)


> it fails with
>
> gcc
Functions.m -c   -DGNUSTEP -DGNUSTEP_VERSION=0.6.6 -DGNUSTEP_MAJOR_VERSION=0
 -DGNUSTEP_MINOR_VERSION=6 -DGNUSTEP_BASE_LIBRARY=1 -DGNU_GUI_LIBRARY=1 -DXG
PS_BACKEND_LIBRARY=1 -DGNU_RUNTIME=1 -D_REENTRANT  -fPIC -DGSWARN -O2 -Wno-i
mport -fgnu-runtime   -I../Headers -I/usr/GNUstep/System/Headers -I/home/phr
/Developer/GNUstep/core/base/Headers/gnustep -I/home/phr/Developer/GNUstep/c
ore/base/Headers -I/home/phr/Developer/GNUstep/core/base/Source/ix86/linux-g
nu -I/home/phr/Developer/GNUstep/core/extensions -I/home/phr/Developer/GNUst
ep/core//Headers    -I. -I/usr/local/include -I/usr/local/include -I/usr/X11
R6/include -I/home/phr/GNUstep/Library/Headers -I/usr/GNUstep/Local/Library/
Headers -I/usr/GNUstep/Network/Library/Headers -I/usr/GNUstep/System/Library
/Headers      -I/usr/GNUstep/Network/Headers -I/usr/GNUstep/System/Headers  
-o shared_obj/ix86/linux-gnu/gnu-gnu-gnu-xgps/Functions.o
> In file included from
/usr/GNUstep/System/Headers/Foundation/NSDecimalNumber.h:31,
>                  from
/usr/GNUstep/System/Headers/Foundation/Foundation.h:47,
>                  from ../Headers/AppKit/NSAttributedString.h:31,
>                  from ../Headers/AppKit/NSStringDrawing.h:38,
>                  from ../Headers/AppKit/NSText.h:101,
>                  from ../Headers/AppKit/NSCStringText.h:32,
>                  from Functions.m:28:
> /usr/GNUstep/System/Headers/Foundation/NSDecimal.h:30: gmp.h: No such file
or directory
> make[4]: *** [shared_obj/ix86/linux-gnu/gnu-gnu-gnu-xgps/Functions.o]
Error 1
> make[3]: *** [gpbs.build] Error 2
> make[2]: *** [gpbs.all.tool.variables] Error 2
> make[2]: Leaving directory `/home/phr/Developer/GNUstep/core/gui/Tools'
> make[1]: *** [internal-all] Error 2
> make[1]: Leaving directory `/home/phr/Developer/GNUstep/core/gui'
> make: *** [subproj-all] Error 2
>
> cheers, Phil
> --
> Philippe C.D. Robert
> Developer - StudioSendai.com
>
>
>
> _______________________________________________
> Discuss-gnustep mailing list
> address@hidden
> http://mail.gnu.org/mailman/listinfo/discuss-gnustep
>
>




reply via email to

[Prev in Thread] Current Thread [Next in Thread]