[Top][All Lists]

[Date Prev][Date Next][Thread Prev][Thread Next][Date Index][Thread Index]

Re: Compile error on gnustep-back

From: Adam Fedor
Subject: Re: Compile error on gnustep-back
Date: Fri, 29 Mar 2002 12:35:17 -0700
User-agent: Mozilla/5.0 (X11; U; Linux ppc; en-US; rv:0.9.7) Gecko/20020120

Dennis Leeuw wrote:

Hi all,

I am trying to build gnustep-back, but am running into trouble:
I am using a CVS snapshot from this morning and have build GNUstep from
make, base and gui went fine.
While building gnustep-back it ends with:

context.c:780: `context' undeclared (first use in this function)
make[3]: *** [shared_obj/ix86/linux-gnu/gnu-gnu-gnu/context.o] Error 1
make[2]: *** [x11.all.subproject.variables] Error 2
make[2]: Leaving directory `/usr/src/SPM/gnustep/core/back/Source/x11'
make[1]: *** [libgnustep-back.all.bundle.subprojects] Error 2
make[1]: Leaving directory `/usr/src/SPM/gnustep/core/back/Source'
make: *** [internal-all] Error 2

I'm not sure why you get that exact problem. I fixed a problem with incorrect includes when you don't have the libwraster library. This should fix your problem.

Adam Fedor, Digital Optics Corp.      | I'm glad I hate spinach, because
http://www.doc.com                    | if I didn't, I'd eat it, and you
                                      | know how I hate the stuff.

reply via email to

[Prev in Thread] Current Thread [Next in Thread]