discuss-gnustep
[Top][All Lists]
Advanced

[Date Prev][Date Next][Thread Prev][Thread Next][Date Index][Thread Index]

Re: Current CVS Solaris problem


From: Richard Frith-Macdonald
Subject: Re: Current CVS Solaris problem
Date: Fri, 18 Mar 2005 13:45:06 +0000

-----BEGIN PGP SIGNED MESSAGE-----
Hash: SHA1

On 2005-03-18 12:58:50 +0000 Andreas Höschler <address@hidden> wrote:

> Hello,
> 
> I just tried to build base from cvs on Solaris 9 and got
> 
> Making all for subproject Additions...
> Compiling file GSCategories.m ...
> In file included from ../../Headers/Foundation/Foundation.h:41,
>                  from GSCategories.m:26:
> .../../Headers/Foundation/NSCharacterSet.h:189: error: parse error before 
> "UTF32Char"
> GSCategories.m: In function `-[NSData(GSCategories) 
> initWithHexadecimalRepresentation:]':
> GSCategories.m:176: warning: subscript has type `char'
> make[3]: *** [shared_obj/GSCategories.o] Error 1
> make[2]: *** [Additions.all.subproject.variables] Error 2
> make[2]: Leaving directory `/usr/share/src/core/base/Source/Additions'
> make[1]: *** [libgnustep-base.all.library.variables] Error 2
> make[1]: Leaving directory `/usr/share/src/core/base/Source'
> make: *** [internal-all] Error 2
> 
> There is a new line referencing UTF32Char in NSCharacterSet.h. This does not 
> seem to be defined in Solaris. How do we solve this?

Running 'configure' should do it.
-----BEGIN PGP SIGNATURE-----
Version: GnuPG v1.2.5 (GNU/Linux)
Comment: Using the GPG bundle for GNUMail

iD8DBQFCOttiE6AJp3nmKIkRAul2AJ0eBSl81P3VlunveN9EN8ERKpgqngCfXFyR
OOk6wPfyGMuwKq3AXGv281w=
=DHgX
-----END PGP SIGNATURE-----





reply via email to

[Prev in Thread] Current Thread [Next in Thread]