[Top][All Lists]

[Date Prev][Date Next][Thread Prev][Thread Next][Date Index][Thread Index]

windows build failure

From: Sean Sieger
Subject: windows build failure
Date: Mon, 02 Aug 2010 11:01:09 -0400
User-agent: Gnus/5.13 (Gnus v5.13) Emacs/24.0.50 (windows-nt)

w32.c:1959:27: error: \x used with no following hex digits
w32.c:1959:27: warning: unknown escape sequence '\i'
make[1]: *** [oo/i386/w32.o] Error 1
make[1]: Leaving directory `c:/emacs-24.0.50/src'
make: *** [all-other-dirs-gmake] Error 2

reply via email to

[Prev in Thread] Current Thread [Next in Thread]