[Top][All Lists]

[Date Prev][Date Next][Thread Prev][Thread Next][Date Index][Thread Index]

[Guile-commits] Hydra job gnu:guile-master:build_without_threads build 3

From: Hydra Build Daemon
Subject: [Guile-commits] Hydra job gnu:guile-master:build_without_threads build 328631 FAILED
Date: Fri, 19 Mar 2010 15:54:51 +0100


This is to let you know that Hydra build 328631 of job 
gnu:guile-master:build_without_threads has changed from SUCCEEDED to FAILED.

Complete build information can be found on this page:

The last 50 lines of the build log are shown at the bottom of this email.

A summary of the build information follows:

Build ID:              | 328631
Nix name:              | guile-without-threads-
Short description:     | Native Nix build on x86_64-linux
Maintainer(s):         | address@hidden
System:                | x86_64-linux
Derivation store path: | 
Output store path:     | 
Time added:            | 2010-03-19 15:54:51
Build started:         | 2010-03-19 15:41:48
Build finished:        | 2010-03-19 15:54:51
Duration:              | 783s

The build inputs were:

Name        | Type  | Value
hydraConfig | svn   |
nixpkgs     | svn   |
tarball     | build | 328613


The Hydra build daemon.

UNRESOLVED: statprof.test: accurate call counting
Running strings.test
Running structs.test
Running sxml.fold.test
Running sxml.ssax.test
Running sxml.transform.test
Running sxml.xpath.test
Running symbols.test
Running syncase.test
Running syntax.test
UNRESOLVED: syntax.test: letrec: bindings: initial bindings are undefined
Running texinfo.docbook.test
Running texinfo.serialize.test
Running texinfo.string-utils.test
Running texinfo.test
Running threads.test
Running time.test
Running tree-il.test
UNRESOLVED: tree-il.test: warnings: unused-toplevel: used by macro
Running unif.test
Running version.test
UNRESOLVED: version.test: version reporting works
Running vlist.test
Running weaks.test

Totals for this test run:
passes:                 11990
failures:               0
unexpected passes:      0
expected failures:      37
unresolved test cases:  1053
untested test cases:    1
unsupported test cases: 15
errors:                 1

FAIL: check-guile
1 of 1 test failed
Please report to address@hidden
make[2]: *** [check-TESTS] Error 1
make[2]: Leaving directory 
make[1]: *** [check-am] Error 2
make[1]: Leaving directory 
make: *** [check-recursive] Error 1
build time elapsed:  0m0.022s 0m0.008s 11m32.650s 0m48.664s
builder for 
failed with exit code 2
error: build of 
Shared connection to kenny closed.

build of 
on address@hidden' failed with exit code 256

reply via email to

[Prev in Thread] Current Thread [Next in Thread]