[Top][All Lists]

[Date Prev][Date Next][Thread Prev][Thread Next][Date Index][Thread Index]

[Guile-commits] Hydra job gnu:guile-master:build_enable_guile_debug buil

From: Hydra Build Daemon
Subject: [Guile-commits] Hydra job gnu:guile-master:build_enable_guile_debug build 812060: Failed with non-zero exit code
Date: Sat, 18 Dec 2010 09:48:30 +0100


This is to let you know that Hydra build 812060 of job 
gnu:guile-master:build_enable_guile_debug has changed from 'Success' to 'Failed 
with non-zero exit code'.

Complete build information can be found on this page:

The last 50 lines of the build log are shown at the bottom of this email.

A summary of the build information follows:

Build ID:              | 812060
Nix name:              | guile-enable-guile-debug-
Short description:     | Native Nix build on x86_64-linux
Maintainer(s):         | address@hidden
System:                | x86_64-linux
Derivation store path: | 
Output store path:     | 
Time added:            | 2010-12-18 09:48:29
Build started:         | 2010-12-18 09:21:00
Build finished:        | 2010-12-18 09:48:29
Duration:              | 1649s

The build inputs were:

Name        | Type  | Value
hydraConfig | svn   |
nixpkgs     | svn   |
tarball     | build | 811966


The Hydra build daemon.

Running syntax.test
UNRESOLVED: syntax.test: letrec: bindings: initial bindings are undefined
UNRESOLVED: syntax.test: letrec*: bindings: initial bindings are undefined
Running texinfo.docbook.test
Running texinfo.serialize.test
Running texinfo.string-utils.test
Running texinfo.test
Running threads.test
Running time.test
Running tree-il.test
UNRESOLVED: tree-il.test: warnings: unused-toplevel: used by macro
Running version.test
FAIL: version.test: version reporting works
Running vlist.test
Running weaks.test
Running web-http.test
Running web-request.test
Running web-response.test
Running web-uri.test

Totals for this test run:
passes:                 14585
failures:               1
unexpected passes:      0
expected failures:      37
unresolved test cases:  562
untested test cases:    1
unsupported test cases: 9
errors:                 0

Some deprecated features have been used.  Set the environment
variable GUILE_WARN_DEPRECATED to "detailed" and rerun the
program to get more information.  Set it to "no" to suppress
this message.
FAIL: check-guile
1 of 1 test failed
Please report to address@hidden
make[3]: *** [check-TESTS] Error 1
make[3]: Leaving directory 
make[2]: *** [check-am] Error 2
make[2]: Leaving directory 
make[1]: *** [check-recursive] Error 1
make[1]: Leaving directory 
make: *** [check] Error 2
build time elapsed:  0m0.018s 0m0.014s 14m42.877s 0m44.783s
builder for 
 failed with exit code 2
error: build of 

reply via email to

[Prev in Thread] Current Thread [Next in Thread]