[Top][All Lists]

[Date Prev][Date Next][Thread Prev][Thread Next][Date Index][Thread Index]

[Guile-commits] Hydra job gnu:guile-2-0:build build 915890: Unknown fail

From: Hydra Build Daemon
Subject: [Guile-commits] Hydra job gnu:guile-2-0:build build 915890: Unknown failure
Date: Tue, 15 Feb 2011 17:24:00 +0100


This is to let you know that Hydra build 915890 of job gnu:guile-2-0:build is 
'Unknown failure'..

Complete build information can be found on this page:

The last 50 lines of the build log are shown at the bottom of this email.

A summary of the build information follows:

Build ID:              | 915890
Nix name:              | guile-
Short description:     | Native Nix build on x86_64-linux
Maintainer(s):         | address@hidden
System:                | x86_64-linux
Derivation store path: | 
Output store path:     | 
Time added:            | 2011-02-15 17:24:00
Build started:         | 2011-02-15 17:08:55
Build finished:        | 2011-02-15 17:24:00
Duration:              | 905s

The build inputs were:

Name        | Type   | Value
hydraConfig | svn    |
nixpkgs     | svn    |
system      | string | x86_64-linux
tarball     | build  | 914063


The Hydra build daemon.

Running sxml.transform.test
Running sxml.xpath.test
Running symbols.test
Running syncase.test
Running syntax.test
UNRESOLVED: syntax.test: letrec: bindings: initial bindings are undefined
UNRESOLVED: syntax.test: letrec*: bindings: initial bindings are undefined
Running texinfo.docbook.test
Running texinfo.serialize.test
Running texinfo.string-utils.test
Running texinfo.test
Running threads.test
Running time.test
Running tree-il.test
UNRESOLVED: tree-il.test: warnings: unused-toplevel: used by macro
Running version.test
FAIL: version.test: version reporting works
Running vlist.test
Running weaks.test
Running web-http.test
Running web-request.test
Running web-response.test
Running web-uri.test

Totals for this test run:
passes:                 33754
failures:               1
unexpected passes:      0
expected failures:      31
unresolved test cases:  555
untested test cases:    1
unsupported test cases: 9
errors:                 0

WARNING: (test-suite sxml-xpath): imported module (sxml xpath) overrides core 
binding `filter'
FAIL: check-guile
1 of 1 test failed
Please report to address@hidden
make[3]: *** [check-TESTS] Error 1
make[3]: Leaving directory 
make[2]: *** [check-am] Error 2
make[2]: Leaving directory 
make[1]: *** [check-recursive] Error 1
make[1]: Leaving directory 
make: *** [check] Error 2
build time elapsed:  0m0.016s 0m0.012s 11m50.448s 0m52.457s
Copying build directory to 
build failed with exit code 2 (ignored)

reply via email to

[Prev in Thread] Current Thread [Next in Thread]