[Top][All Lists]

[Date Prev][Date Next][Thread Prev][Thread Next][Date Index][Thread Index]

[Guile-commits] Hydra job gnu:guile-2-0:build_CPPFLAGS=_DSCM_DEBUG_TYPIN

From: Hydra Build Daemon
Subject: [Guile-commits] Hydra job gnu:guile-2-0:build_CPPFLAGS=_DSCM_DEBUG_TYPING_STRICTNESS=2 build 1927648: Failed
Date: Mon, 23 Jan 2012 00:51:13 +0100


This is to let you know that Hydra build 1927648 of job 
gnu:guile-2-0:build_CPPFLAGS=_DSCM_DEBUG_TYPING_STRICTNESS=2 has changed from 
'Success' to 'Failed'.

Complete build information can be found on this page:

The last 50 lines of the build log are shown at the bottom of this email.

A summary of the build information follows:

Build ID:              | 1927648
Nix name:              | 
Short description:     | Native Nix build on x86_64-linux
Maintainer(s):         | address@hidden
System:                | x86_64-linux
Derivation store path: | 
Output store path:     | 
Time added:            | 2012-01-23 00:51:13
Build started:         | 2012-01-23 00:33:40
Build finished:        | 2012-01-23 00:51:13
Duration:              | 1053s

The build inputs were:

Name        | Type  | Value
hydraConfig | git   | 
nixpkgs     | svn   |
tarball     | build | 1927627


The Hydra build daemon.

Running sxml.transform.test
Running sxml.xpath.test
Running symbols.test
Running syncase.test
Running syntax.test
UNRESOLVED: syntax.test: letrec: bindings: initial bindings are undefined
UNRESOLVED: syntax.test: letrec*: bindings: initial bindings are undefined
Running texinfo.docbook.test
Running texinfo.serialize.test
Running texinfo.string-utils.test
Running texinfo.test
Running threads.test
Running time.test
Running tree-il.test
UNRESOLVED: tree-il.test: warnings: unused-toplevel: used by macro
Running version.test
UNRESOLVED: version.test: version reporting works
Running vlist.test
Running weaks.test
Running web-http.test
Running web-request.test
Running web-response.test
Running web-uri.test

Totals for this test run:
passes:                 34341
failures:               3
unexpected passes:      0
expected failures:      30
unresolved test cases:  562
untested test cases:    1
unsupported test cases: 9
errors:                 0

WARNING: (test-suite sxml-xpath): imported module (sxml xpath) overrides core 
binding `filter'
FAIL: check-guile
1 of 1 test failed
Please report to address@hidden
make[3]: *** [check-TESTS] Error 1
make[3]: Leaving directory 
make[2]: *** [check-am] Error 2
make[2]: Leaving directory 
make[1]: *** [check-recursive] Error 1
make[1]: Leaving directory 
make: *** [check] Error 2
build time elapsed:  0m0.015s 0m0.015s 15m50.962s 0m41.119s
Copying build directory to 
build failed with exit code 2 (ignored)

reply via email to

[Prev in Thread] Current Thread [Next in Thread]