[Top][All Lists]

[Date Prev][Date Next][Thread Prev][Thread Next][Date Index][Thread Index]

[Guile-commits] Hydra job gnu:guile-2-0:build on i686-linux, build 26271

From: Hydra Build Daemon
Subject: [Guile-commits] Hydra job gnu:guile-2-0:build on i686-linux, build 2627118: Failed with non-zero exit code
Date: Tue, 15 May 2012 13:57:43 +0200


This is to let you know that Hydra build 2627118 of job gnu:guile-2-0:build has 
changed from 'Success' to 'Failed with non-zero exit code'.

Complete build information can be found on this page:

The last 50 lines of the build log are shown at the bottom of this email.

A summary of the build information follows:

Build ID:              | 2627118
Nix name:              | guile-
Short description:     | Native Nix build on i686-linux
Maintainer(s):         | address@hidden
System:                | i686-linux
Derivation store path: | 
Output store path:     | 
Time added:            | 2012-05-15 13:57:42
Build started:         | 2012-05-15 13:08:04
Build finished:        | 2012-05-15 13:57:42
Duration:              | 2978s

The build inputs were:

Name        | Type   | Value
hydraConfig | git    | 
nixpkgs     | svn    |
tarball     | build  | 2627106
guileSrc    | git    | 
system      | string | i686-linux


The Hydra build daemon.

Running sxml.transform.test
Running sxml.xpath.test
Running symbols.test
Running syncase.test
Running syntax.test
UNRESOLVED: syntax.test: letrec: bindings: initial bindings are undefined
UNRESOLVED: syntax.test: letrec*: bindings: initial bindings are undefined
Running texinfo.docbook.test
Running texinfo.serialize.test
Running texinfo.string-utils.test
Running texinfo.test
Running threads.test
Running time.test
Running tree-il.test
UNRESOLVED: tree-il.test: warnings: unused-toplevel: used by macro
Running version.test
UNRESOLVED: version.test: version reporting works
Running vlist.test
Running weaks.test
Running web-http.test
Running web-request.test
Running web-response.test
Running web-uri.test

Totals for this test run:
passes:                 34429
failures:               2
unexpected passes:      0
expected failures:      30
unresolved test cases:  574
untested test cases:    1
unsupported test cases: 9
errors:                 0

WARNING: (test-suite sxml-xpath): imported module (sxml xpath) overrides core 
binding `filter'
FAIL: check-guile
1 of 1 test failed
Please report to address@hidden
make[3]: *** [check-TESTS] Error 1
make[3]: Leaving directory 
make[2]: *** [check-am] Error 2
make[2]: Leaving directory 
make[1]: *** [check-recursive] Error 1
make[1]: Leaving directory 
make: *** [check] Error 2
build time elapsed:  0m0.037s 0m0.019s 48m1.049s 1m9.645s
builder for 
`/nix/store/rmqi9h8cxci3zs5mafvmnrnfg6nmpjgj-guile-' failed 
with exit code 2
error: build of 
`/nix/store/rmqi9h8cxci3zs5mafvmnrnfg6nmpjgj-guile-' failed

reply via email to

[Prev in Thread] Current Thread [Next in Thread]