help-cfengine
[Top][All Lists]
Advanced

[Date Prev][Date Next][Thread Prev][Thread Next][Date Index][Thread Index]

cfengine-2.0.4 make problem


From: Daniel Roccaforte
Subject: cfengine-2.0.4 make problem
Date: Tue, 29 Oct 2002 10:03:48 -0700

I am unable to compile cfengine-2.0.4 on HP-UX 11.00.  I am aware that I
can download pre-compiled binaries from the porting archive, but I need to
put cfengine in a different place.  Here is the make error I am getting.  I
am lost at this point.


GCC-3.2
FLEX-2.5.4a
BISON-1.35
BerkeleyDB-3.3.11
openssl- 0.9.6d

I would greatly appreciate your help.

-Daniel Roccaforte
---------------------- Forwarded by Daniel Roccaforte/CCO/Celestica on
10/29/2002 09:59 AM ---------------------------


address@hidden on 10/29/2002 09:59:21 AM

To:    address@hidden
cc:

Subject:    cfengine-2.0.4 make problem


Making all in pub
gmake[1]: Entering directory `/tmp/build/CFENGINE/cfengine-2.0.4/pub'
gmake[1]: Nothing to be done for `all'.
gmake[1]: Leaving directory `/tmp/build/CFENGINE/cfengine-2.0.4/pub'
Making all in src
gmake[1]: Entering directory `/tmp/build/CFENGINE/cfengine-2.0.4/src'
Makefile:546: warning: overriding commands for target `cfparse.h'
Makefile:523: warning: ignoring old commands for target `cfparse.h'
gmake  all-am
gmake[2]: Entering directory `/tmp/build/CFENGINE/cfengine-2.0.4/src'
Makefile:546: warning: overriding commands for target `cfparse.h'
Makefile:523: warning: ignoring old commands for target `cfparse.h'
gcc -fPIC  -g -O2 -Wreturn-type -Wmissing-prototypes -Wuninitialized -g -O2
-I/opt/BerkeleyDB-3.3.11/include    -L/opt/BerkeleyDB-3.3.11/lib
-L/opt/openssl/lib /opt/BerkeleyDB-3.3.11/lib/libdb-3.3.a
/opt/openssl/lib/libcrypto.a /opt/openssl/lib/libssl.a -L/opt/dce/lib -o
cfagent  cfagent.o init.o do.o wrapper.o report.o client.o ip.o process.o
ifconf.o image.o item.o item-ext.o item-file.o 2Dlist.o globals.o classes.o
misc.o parse.o functions.o edittools.o patches.o install.o link.o tidy.o
filedir.o eval.o modes.o chflags.o locks.o mount.o macro.o filenames.o
varstring.o wildcard.o cfparse.o comparray.o read.o checksums.o proto.o
filters.o copy.o repository.o rotate.o errors.o cflex.o net.o df.o log.o
crypto.o popen.o popen_def.o sensible.o acl.o dce_acl.o nameinfo.o
strategies.o -lfl -ldb -lcrypto -lPW -lpthread -lm  -lc -L../pub -lpub
/usr/ccs/bin/ld: Unsatisfied symbols:
   Error (data)
collect2: ld returned 1 exit status
gmake[2]: *** [cfagent] Error 1
gmake[2]: Leaving directory `/tmp/build/CFENGINE/cfengine-2.0.4/src'
gmake[1]: *** [all] Error 2
gmake[1]: Leaving directory `/tmp/build/CFENGINE/cfengine-2.0.4/src'
gmake: *** [all-recursive] Error 1








reply via email to

[Prev in Thread] Current Thread [Next in Thread]