[Top][All Lists]

[Date Prev][Date Next][Thread Prev][Thread Next][Date Index][Thread Index]

GUB dblatex breaks compile

From: Graham Percival
Subject: GUB dblatex breaks compile
Date: Thu, 16 Feb 2012 11:14:31 +0000
User-agent: Mutt/1.5.20 (2009-06-14)

GUB cannot build master: (GNU LilyPond) 2.15.30
cd ./out-test && dblatex suffix-lyxml.xml
Traceback (most recent call last):
  File "/usr/bin/dblatex", line 10, in ?
    from contrib.debian.errorhandler import DebianHandler
  File "/usr/share/dblatex/lib/contrib/debian/",
line 8, in ?
    import apt
ImportError: No module named apt
make[1]: *** [out-test/suffix-lyxml.pdf] Error 1
make[1]: Leaving directory
make: *** [test] Error 2

Julien, the lilypond-book regtests are the obvious contender for
this.  If the bugfix is not obvious, could you revert that commit
so that we can have the 2.15.30 release while we investigate this
as a separate patch?

The correct bugfix may be simply to update the version of dblatex
in GUB, but that is rarely as simple as it sounds.

- Graham

reply via email to

[Prev in Thread] Current Thread [Next in Thread]