[Top][All Lists]

[Date Prev][Date Next][Thread Prev][Thread Next][Date Index][Thread Index]

latest CVS compile errors

From: David Bobroff
Subject: latest CVS compile errors
Date: 18 Apr 2003 18:50:02 +0000

I'm getting errors trying to comple the latest CVS (as of ca. 11:00UTC
18 April).

./out/lilypond.nexi:3918: Next reference to nonexistent node `End of
./out/lilypond.nexi:770: Menu reference to nonexistent node `End of
makeinfo: Removing output file `./out/' due to errors; use
to preserve.
make[2]: *** [out/] Error 2
rm out/lilypond.nexi
make[2]: Leaving directory `/home/lily-cvs/lilypond/Documentation/user'
make[1]: *** [all] Error 2
rm out/index.texi
make[1]: Leaving directory `/home/lily-cvs/lilypond/Documentation'
make: *** [all] Error 2
address@hidden lilypond]#

This is the same set of exit errors I was getting earlier today with the
previous CVS. (Stock RH9.0 system)

-David Bobroff

reply via email to

[Prev in Thread] Current Thread [Next in Thread]