[Top][All Lists]

[Date Prev][Date Next][Thread Prev][Thread Next][Date Index][Thread Index]

2.1.27 Debian unstable PPC source package build errors

From: Mark Van den Borre
Subject: 2.1.27 Debian unstable PPC source package build errors
Date: Thu, 26 Feb 2004 13:06:43 +0100

Hi all,

Her I am again with my Debian PPC build errors, this time for LilyPond

I included extensive information about my build environment, and useful
output from the package build itself. Hints on a solution highly


P.S. Please tell me if you think harassing the list like this with my
build problems is inappropriate.

* the build dependencies I have installed:

|/ Fout?=(geen)/Hold/Reinst nodig/X=beide (Status,Fout:
||/ Naam           Versie         Omschrijving
ii  debhelper      4.2.4          helper programs for debian/rules
ii  binutils  The GNU assembler, linker and binary
ii  libc6-dev      2.3.2.ds1-11   GNU C Library: Development Libraries
and Hea
un  libc6.1-dev    <geen>         (geen beschrijving beschikbaar)
ii  python-dev     2.3.3-6        Header files and a static library for
ii  guile-1.6-dev  1.6.4-4        Development files for Guile 1.6
un  libguile-dev   <geen>         (geen beschrijving beschikbaar)
ii  tetex-bin      2.0.2-6        The teTeX binary files
ii  libkpathsea-de 2.0.2-6        path search library for teTeX (devel
ii  tetex-extra    2.0.2-5.1      Additional library files of teTeX
ii  flex           2.5.31-22      A fast lexical analyzer generator.
ii  bison          1.875a-1       A parser generator that is compatible
with Y
ii  texinfo        4.6-1          Documentation system for on-line
ii  groff          1.18.1-15      GNU troff text-formatting system
ii  m4             1.4-17         a macro processing language
ii  gettext        0.14.1-1       GNU Internationalization utilities
ii  mftrace        1.0.19-1       Converts Metafont fonts into Type1
ii  pfaedit        0.0.20040111-1 Font Editor for PS, TrueType and
OpenType fo
ii  autotrace      0.31.1-4       bitmap to vector graphics converter
ii  t1utils        1.31-1         A collection of simple Type 1 font
ii  gs             7.07-1         The Ghostscript Postscript interpreter
un  gs-aladdin     <geen>         (geen beschrijving beschikbaar)
ii  netpbm         10.0-3         Graphics conversion tools

* the error messages when trying to build the 2.1.27 .deb source package
from Pedro Kroeger:

Document Class: article 2001/04/21 v1.4e Standard LaTeX document class
No auxiliary output files.
No file lily-2091815391.aux.
[1] )
Output written on lily-2091815391.dvi (1 page, 2220 bytes).
Transcript written on lily-2091815391.log.
Invoking `dvips -Ppdf -E -o lily-2091815391.eps
lily-2091815391'This is dvips(k) 5.92b Copyright 2002 Radical Eye
Software (' TeX output 2004.02.25:1944' ->
<><>. <feta-nummer10.pfa><cmss12.pfb><cmb10.pfb>
Invoking `gs -sDEVICE=bbox -q -dNOPAUSE lily-2091815391.eps -c quit
Invoking `gs -g336x116 -sDEVICE=pnggray  -dTextAlphaBits=4
-dGraphicsAlphaBits=4  -q -sOutputFile=lily-2091815391.png -r110
-dNOPAUSE lily-2091815391.eps -c quit '
Invoking `(( latex "\nonstopmode \input lily-1840723219"  >&2 ) >&-
)'This is Te X, Version 3.14159 (Web2C 7.4.5)
LaTeX2e <2001/06/01>
Babel <v3.7h> and hyphenation patterns for american, french, ngerman,
dutch, nohyphenation, loaded.
Document Class: article 2001/04/21 v1.4e Standard LaTeX document class
No auxiliary output files.
No file lily-1840723219.aux.
[1] )
Output written on lily-1840723219.dvi (1 page, 9424 bytes).
Transcript written on lily-1840723219.log.
Invoking `dvips -Ppdf -E -o lily-1840723219.eps
lily-1840723219'This is dvips(k) 5.92b Copyright 2002 Radical Eye
Software (' TeX output 2004.02.25:1944' ->
<>. <feta-braces40.pfa><feta-nummer10.pfa><cmbxti8.pfa>
Invoking `gs -sDEVICE=bbox -q -dNOPAUSE lily-1840723219.eps -c quit
2>lily-1840723219.eps.bbox'Error: /limitcheck in --.type1execchar--
Operand stack:
   -592   --dict:13/14(ro)(L)--   50   braceABY   -string-
Execution stack:
   %interp_exit   .runexec2   --nostringval--   --nostringval--  
--nostringval--   2   %stopped_push   --nostringval--  
--nostringval--   --nostringval--   fa lse   1   %stopped_push   1   3  
%oparray_pop   1   3   %oparray_pop   --nostringval--   1   3  
%oparray_pop   1   3   %oparray_pop   .runexec2   --nostringval--  
--nostringval--   --nostringval--   2   %stopped_push   --nostringval--
--nostringval--   %finish_show   --nostringval--   --nostringval--   5  
4   1 --nostringval--   (gs_show_enum)   %op_show_continue  
--nostringval--   --nostringval--
Dictionary stack:
   --dict:1070/1123(ro)(G)--   --dict:0/20(G)--   --dict:94/200(L)--  
Current allocation mode is local
Last OS error: 2
Current file position is 83829
lilypond-book: error: `gs' failed (status 1)
Traceback (most recent call last):
  File "/root/debs/lilypond-2.1.27/scripts/", line 902,
in ?
    main ()
  File "/root/debs/lilypond-2.1.27/scripts/", line 899,
in main    do_file (files[0])
  File "/root/debs/lilypond-2.1.27/scripts/", line 836,
in do_file
    filter (lambda x: x.__class__ == Include_snippet, chunks))
  File "/root/debs/lilypond-2.1.27/scripts/", line 833,
in process_include
    do_file (name)
  File "/root/debs/lilypond-2.1.27/scripts/", line 818,
in do_file
    process_snippets (process_cmd, outdated)
  File "/root/debs/lilypond-2.1.27/scripts/", line 665,
in process_snippets
    ly.make_ps_images (i + '.eps', resolution=110)
  File "/root/debs/lilypond-2.1.27/share/lilypond/python/",
line 460,in make_ps_images
    bbox = get_bbox (ps_name)
  File "/root/debs/lilypond-2.1.27/share/lilypond/python/",
line 438,in get_bbox
    system (cmd, progress_p = 1)
  File "/root/debs/lilypond-2.1.27/share/lilypond/python/",
line 332,in system
    exit (status)
  File "/root/debs/lilypond-2.1.27/share/lilypond/python/",
line 130,in exit
    raise _ ('Exiting (%d)...') % i
Exiting (256)...
make[4]: *** [out-www/lilypond.texi] Error 1
make[4]: Leaving directory
make[3]: *** [WWW] Error 2
make[3]: Leaving directory `/root/debs/lilypond-2.1.27/Documentation'
make[2]: *** [WWW] Error 2
make[2]: Leaving directory `/root/debs/lilypond-2.1.27'
make[1]: *** [web] Error 2
make[1]: Leaving directory `/root/debs/lilypond-2.1.27'
make: *** [build-doc-stamp] Error 2
Build command 'cd lilypond-2.1.27 && dpkg-buildpackage -b -uc' failed.
E: Child process failed
Mark Van den Borre
Noormannenstraat 113
3000 Leuven, Belgiƫ
+32 486 961726

reply via email to

[Prev in Thread] Current Thread [Next in Thread]