[Top][All Lists]

[Date Prev][Date Next][Thread Prev][Thread Next][Date Index][Thread Index]

[Acl-devel] attr-2.4.48 test failure

From: Rick Shelton
Subject: [Acl-devel] attr-2.4.48 test failure
Date: Fri, 28 Dec 2018 15:47:40 -0600

I am getting an unexpected test failure in 6.25 Attr-2.4.48. Log file
is attached. It warned of an un-escaped brace, but escaping that did
not change the test results.
I found an older message on a forum that complained of a similar
failure when building attr-2.4.47. The advice was to ignore it and
move on.
I'm going to move on, but does anyone have any insight here?


make  check-TESTS
make[2]: Entering directory '/sources/attr-2.4.48'
make[3]: Entering directory '/sources/attr-2.4.48'
PASS: test/attr.test
FAIL: test/root/getfattr.test
Testsuite summary for attr 2.4.48
# TOTAL: 2
# PASS:  1
# SKIP:  0
# XFAIL: 0
# FAIL:  1
# XPASS: 0
# ERROR: 0
See ./test-suite.log
Please report to address@hidden
make[3]: *** [Makefile:1327: test-suite.log] Error 1
make[3]: Leaving directory '/sources/attr-2.4.48'
make[2]: *** [Makefile:1435: check-TESTS] Error 2
make[2]: Leaving directory '/sources/attr-2.4.48'
make[1]: *** [Makefile:1655: check-am] Error 2
make[1]: Leaving directory '/sources/attr-2.4.48'
make: *** [Makefile:1212: check-recursive] Error 1
(lfs chroot) root:/sources/attr-2.4.48#

Attachment: test-suite.log
Description: Text Data

reply via email to

[Prev in Thread] Current Thread [Next in Thread]