[Top][All Lists]

[Date Prev][Date Next][Thread Prev][Thread Next][Date Index][Thread Index]

Re: Automake 1.11.2b test release

From: Peter Rosin
Subject: Re: Automake 1.11.2b test release
Date: Thu, 26 Jan 2012 16:08:03 +0100
User-agent: Mozilla/5.0 (Windows NT 6.1; WOW64; rv:9.0) Gecko/20111222 Thunderbird/9.0.1

Stefano Lattarini skrev 2012-01-25 09:40:
> Please report bugs and problems to <address@hidden>, and send
> general comments and feedback to <address@hidden>.

Looks as usual on MinGW with cl, with only lzma.test failing as reported
previously (can be avoided with XZ_DEFAULTS=--memlimit=150MiB in the
environment, but I forgot about that).


$ export CC="/home/peda/automake-1.11.2b/lib/compile cl -nologo"
$ export CFLAGS=
$ export CXX="/home/peda/automake-1.11.2b/lib/compile cl -nologo"
$ export CXXFLAGS=
$ export NM="dumpbin -symbols"
$ export STRIP=:
$ export AR="/home/peda/automake-1.11.2b/lib/ar-lib lib"
$ export RANLIB=:
$ ./configure
checking whether make supports nested variables... yes
checking build system type... i686-pc-mingw32
checking for a BSD-compatible install... /bin/install -c
checking whether build environment is sane... yes
checking for a thread-safe mkdir -p... /bin/mkdir -p
checking for gawk... gawk
checking whether make sets $(MAKE)... yes
checking for perl... /bin/perl
checking whether /bin/perl supports ithreads... no
checking for tex... no
checking whether autoconf is installed... yes
checking whether autoconf works... yes
checking whether autoconf is recent enough... yes
checking whether ln works... yes
checking for grep that handles long lines and -e... /bin/grep
checking for egrep... /bin/grep -E
checking for fgrep... /bin/grep -F
checking whether /bin/sh has working 'set -e' with exit trap... yes
configure: creating ./config.status
config.status: creating Makefile
config.status: creating contrib/Makefile
config.status: creating doc/Makefile
config.status: creating lib/Automake/Makefile
config.status: creating lib/Makefile
config.status: creating lib/am/Makefile
config.status: creating m4/Makefile
config.status: creating tests/Makefile
config.status: creating tests/defs
config.status: creating tests/aclocal-1.11
config.status: creating tests/automake-1.11

WARNING: You are about to use a beta version of automake.
WARNING: It might easily suffer from new bugs or regressions.
WARNING: You are strongly advised not to use it in production code.

Please report bugs, problems and feedback to <address@hidden>.
$ make
Making all in lib
make[1]: Entering directory `/home/peda/automake-1.11.2b/lib'
Making all in Automake
make[2]: Entering directory `/home/peda/automake-1.11.2b/lib/Automake'
make[2]: Leaving directory `/home/peda/automake-1.11.2b/lib/Automake'
Making all in am
make[2]: Entering directory `/home/peda/automake-1.11.2b/lib/am'
make[2]: Nothing to be done for `all'.
make[2]: Leaving directory `/home/peda/automake-1.11.2b/lib/am'
make[2]: Entering directory `/home/peda/automake-1.11.2b/lib'
make[2]: Nothing to be done for `all-am'.
make[2]: Leaving directory `/home/peda/automake-1.11.2b/lib'
make[1]: Leaving directory `/home/peda/automake-1.11.2b/lib'
Making all in .
make[1]: Entering directory `/home/peda/automake-1.11.2b'
  GEN    automake
  GEN    aclocal
make[1]: Leaving directory `/home/peda/automake-1.11.2b'
Making all in contrib
make[1]: Entering directory `/home/peda/automake-1.11.2b/contrib'
make[1]: Nothing to be done for `all'.
make[1]: Leaving directory `/home/peda/automake-1.11.2b/contrib'
Making all in doc
make[1]: Entering directory `/home/peda/automake-1.11.2b/doc'
make[1]: Nothing to be done for `all'.
make[1]: Leaving directory `/home/peda/automake-1.11.2b/doc'
Making all in m4
make[1]: Entering directory `/home/peda/automake-1.11.2b/m4'
make[1]: Nothing to be done for `all'.
make[1]: Leaving directory `/home/peda/automake-1.11.2b/m4'
Making all in tests
make[1]: Entering directory `/home/peda/automake-1.11.2b/tests'
make[1]: Nothing to be done for `all'.
make[1]: Leaving directory `/home/peda/automake-1.11.2b/tests'
$ make check -j8
Making check in lib
make[1]: Entering directory `/home/peda/automake-1.11.2b/lib'
Making check in Automake
make[2]: Entering directory `/home/peda/automake-1.11.2b/lib/Automake'
make[2]: Nothing to be done for `check'.
make[2]: Leaving directory `/home/peda/automake-1.11.2b/lib/Automake'
Making check in am
make[2]: Entering directory `/home/peda/automake-1.11.2b/lib/am'
make[2]: Nothing to be done for `check'.
make[2]: Leaving directory `/home/peda/automake-1.11.2b/lib/am'
make[2]: Entering directory `/home/peda/automake-1.11.2b/lib'
make[2]: Nothing to be done for `check-am'.
make[2]: Leaving directory `/home/peda/automake-1.11.2b/lib'
make[1]: Leaving directory `/home/peda/automake-1.11.2b/lib'
Making check in .
make[1]: Entering directory `/home/peda/automake-1.11.2b'
make[1]: Nothing to be done for `check-am'.
make[1]: Leaving directory `/home/peda/automake-1.11.2b'
Making check in contrib
make[1]: Entering directory `/home/peda/automake-1.11.2b/contrib'
make[1]: Nothing to be done for `check'.
make[1]: Leaving directory `/home/peda/automake-1.11.2b/contrib'
Making check in doc
make[1]: Entering directory `/home/peda/automake-1.11.2b/doc'
make[1]: Nothing to be done for `check'.
make[1]: Leaving directory `/home/peda/automake-1.11.2b/doc'
Making check in m4
make[1]: Entering directory `/home/peda/automake-1.11.2b/m4'
make[1]: Nothing to be done for `check'.
make[1]: Leaving directory `/home/peda/automake-1.11.2b/m4'
Making check in tests
make[1]: Entering directory `/home/peda/automake-1.11.2b/tests'
make  defs aclocal-1.11 automake-1.11
make[2]: Entering directory `/home/peda/automake-1.11.2b/tests'
make[2]: `defs' is up to date.
make[2]: `aclocal-1.11' is up to date.
make[2]: `automake-1.11' is up to date.
make[2]: Leaving directory `/home/peda/automake-1.11.2b/tests'
make  check-TESTS
make[2]: Entering directory `/home/peda/automake-1.11.2b/tests'
make[3]: Entering directory `/home/peda/automake-1.11.2b/tests'
SKIP: pm/
SKIP: pm/
PASS: pm/
PASS: pm/
PASS: pm/
PASS: pm/
SKIP: get-sysconf.test
PASS: self-check-env-sanitize.test
PASS: self-check-report.test
PASS: aclocal3.test
PASS: aclocal.test
PASS: aclocal8.test
PASS: acloca11.test
PASS: aclibobj.test
PASS: aclocal9.test
PASS: acloca12.test
PASS: acloca15.test
PASS: acloca16.test
PASS: acloca17.test
PASS: aclocal6.test
PASS: acloca10.test
PASS: acloca19.test
PASS: acloca21.test
PASS: acloca13.test
PASS: aclocal5.test
PASS: aclocal-install-absdir.test
PASS: aclocal-print-acdir.test
PASS: acloca20.test
PASS: aclocal4.test
PASS: aclocal-path-install.test
PASS: aclocal-path.test
PASS: aclocal-path-nonexistent.test
PASS: acloca18.test
PASS: aclocal-path-precedence.test
PASS: aclocal-acdir.test
PASS: acoutnoq.test
PASS: acoutpt.test
PASS: aclocal-path-install-serial.test
PASS: acloca14.test
PASS: acoutqnl.test
PASS: acsilent.test
PASS: acoutpt2.test
PASS: acsubst.test
PASS: acsubst2.test
XFAIL: all.test
PASS: acloca22.test
PASS: aclocal7.test
PASS: acoutbs.test
PASS: acoutbs2.test
SKIP: amhello-cross-compile.test
PASS: alloca.test
PASS: alloca2.test
PASS: ammissing.test
PASS: amassign.test
PASS: amopt.test
PASS: all2.test
PASS: alpha2.test
PASS: alpha.test
PASS: amsubst.test
PASS: ansi2.test
PASS: amhello-binpkg.test
PASS: amhello-cflags.test
PASS: ansi4.test
PASS: ansi8.test
PASS: ansi3b.test
PASS: ansi3.test
PASS: ansi.test
PASS: ar-lib.test
PASS: ar-lib2.test
PASS: ansi5.test
PASS: ar-lib3.test
PASS: libtool-macros.test
PASS: ansi9.test
PASS: ansi6.test
PASS: ar-lib7.test
PASS: ansi2knr-deprecation.test
PASS: ansi7.test
PASS: ar2.test
PASS: ar3.test
PASS: ansi10.test
PASS: ar.test
PASS: ar4.test
PASS: ar5.test
PASS: ar-lib5a.test
PASS: autodist-acconfig.test
PASS: ar-lib5b.test
PASS: asm.test
PASS: autodist-acconfig-no-subdir.test
PASS: asm2.test
PASS: autodist-no-duplicate.test
PASS: autohdr.test
PASS: autodist.test
PASS: autohdr2.test
PASS: autodist-configure-no-subdir.test
PASS: asm3.test
PASS: autodist-config-headers.test
PASS: autodist-subdir.test
PASS: autodist-aclocal-m4.test
PASS: auxdir.test
PASS: automake.test
XFAIL: auxdir2.test
PASS: autodist-stamp-vti.test
PASS: auxdir3.test
PASS: auxdir4.test
PASS: backsl2.test
PASS: backsl.test
PASS: backsl3.test
PASS: badline.test
PASS: badopt.test
PASS: badprog.test
PASS: block.test
PASS: autohdrdry.test
PASS: bsource.test
PASS: canon.test
PASS: canon2.test
PASS: canon3.test
PASS: canon4.test
PASS: backsl4.test
PASS: canon-name.test
PASS: check.test
PASS: autohdr3.test
PASS: autohdr4.test
PASS: ccnoco2.test
PASS: canon5.test
PASS: check2.test
PASS: ccnoco3.test
PASS: check3.test
PASS: check4.test
PASS: check5.test
SKIP: check12.test
PASS: ccnoco.test
PASS: check11.test
PASS: check10.test
PASS: check-exported-srcdir.test
PASS: check6.test
PASS: check-tests_environment.test
PASS: checkall.test
PASS: check7.test
PASS: check-concurrency-bug9245.test
PASS: clean.test
PASS: check8.test
PASS: colneq2.test
PASS: check-tests-in-builddir.test
PASS: check9.test
PASS: colneq.test
PASS: colon.test
PASS: colon2.test
PASS: colon3.test
PASS: colon4.test
SKIP: color2.test
PASS: clean2.test
PASS: colon5.test
PASS: tests-environment-backcompat.test
PASS: colon6.test
PASS: colon7.test
PASS: comment.test
PASS: comment2.test
PASS: comment3.test
PASS: comment4.test
PASS: comment7.test
PASS: comment9.test
PASS: color.test
PASS: commen10.test
PASS: commen11.test
PASS: compile.test
SKIP: compile2.test
PASS: compile3.test
PASS: compile6.test
PASS: comment8.test
PASS: compile_f90_c_cxx.test
PASS: compile_f_c_cxx.test
PASS: comment5.test
PASS: comments-in-var-def.test
PASS: cond.test
PASS: cond2.test
PASS: comment6.test
PASS: cond3.test
PASS: compile5.test
PASS: cond6.test
PASS: cond7.test
PASS: cond8.test
PASS: cond10.test
PASS: compile4.test
PASS: cond5.test
PASS: cond13.test
PASS: cond14.test
PASS: cond15.test
PASS: cond9.test
XFAIL: cond17.test
PASS: cond20.test
PASS: cond16.test
PASS: cond23.test
PASS: cond18.test
PASS: cond24.test
PASS: cond25.test
PASS: cond26.test
PASS: cond21.test
PASS: cond22.test
PASS: cond27.test
PASS: cond11.test
PASS: cond28.test
PASS: cond4.test
SKIP: cond35.test
PASS: cond29.test
PASS: cond36.test
PASS: cond19.test
PASS: cond33.test
PASS: cond37.test
PASS: cond41.test
PASS: cond38.test
PASS: cond30.test
PASS: cond31.test
PASS: cond34.test
PASS: cond43.test
PASS: cond44.test
PASS: cond45.test
PASS: cond42.test
PASS: condinc.test
PASS: cond40.test
PASS: cond32.test
PASS: condhook.test
PASS: condinc2.test
PASS: condhook2.test
PASS: condlib.test
PASS: condman.test
PASS: condman2.test
PASS: conff2.test
PASS: condd.test
PASS: configure.test
PASS: confdeps.test
PASS: confh4.test
PASS: cond39.test
PASS: confincl.test
PASS: condman3.test
PASS: confh7.test
PASS: conflnk.test
PASS: confh.test
PASS: conflnk2.test
PASS: confh6.test
PASS: conff.test
PASS: confh8.test
PASS: confh5.test
PASS: confvar.test
PASS: confvar2.test
PASS: copy.test
PASS: ctarget1.test
PASS: conflnk3.test
PASS: cxx.test
PASS: cxx2.test
PASS: cxxansi.test
PASS: cxxcpp.test
PASS: cxxlibobj.test
PASS: confsub.test
PASS: cxxlink.test
PASS: cxxnoc.test
PASS: cxxo.test
PASS: defun.test
SKIP: dejagnu3.test
SKIP: dejagnu4.test
SKIP: dejagnu5.test
SKIP: dejagnu6.test
SKIP: dejagnu7.test
SKIP: dejagnu-absolute-builddir.test
SKIP: dejagnu-relative-srcdir.test
SKIP: dejagnu-siteexp-extend.test
PASS: cygwin32.test
PASS: dash.test
PASS: defun2.test
PASS: dejagnu.test
PASS: conflnk4.test
PASS: depacl2.test
PASS: depcomp.test
SKIP: depcomp4.test
SKIP: depcomp5.test
PASS: dejagnu2.test
PASS: dejagnu-siteexp-useredit.test
PASS: dejagnu-siteexp-append.test
PASS: depcomp2.test
SKIP: depcomp9.test
PASS: depcomp3.test
PASS: deleted-am.test
PASS: depdist.test
PASS: depend.test
PASS: deleted-m4.test
SKIP: depcomp10.test
PASS: depcomp6.test
PASS: depend3.test
SKIP: destdir.test
PASS: dirlist.test
PASS: depend2.test
PASS: dirlist2.test
PASS: discover.test
PASS: depend6.test
PASS: depend4.test
PASS: depend5.test
PASS: dist-included-parent-dir.test
XFAIL: dist-auxfile-2.test
PASS: dist-missing-included-m4.test
XFAIL: dist-auxfile.test
PASS: distcom2.test
PASS: depcomp8a.test
PASS: dist-missing-am.test
PASS: distcom6.test
PASS: distcom3.test
PASS: dist-missing-m4.test
PASS: distcom7.test
SKIP: distlinksbrk.test
PASS: distcom4.test
PASS: distcom5.test
PASS: distlinks.test
PASS: distname.test
PASS: distdir.test
PASS: distcleancheck.test
PASS: distcheck-configure-flags.test
PASS: distcheck-hook.test
PASS: distcheck-configure-flags-am.test
PASS: distcheck-configure-flags-subpkg.test
SKIP: distcheck-override-infodir.test
PASS: depcomp7.test
PASS: doc-parsing-buglets-colneq-subst.test
PASS: distcheck-hook2.test
PASS: doc-parsing-buglets-tabs.test
PASS: distcheck-pr10470.test
PASS: dollar.test
PASS: dmalloc.test
PASS: distcheck-pr9579.test
PASS: dup2.test
PASS: depcomp8b.test
PASS: double.test
PASS: else.test
PASS: dollarvar.test
PASS: empty2.test
PASS: empty3.test
PASS: empty4.test
PASS: exdir.test
PASS: empty.test
PASS: exdir2.test
PASS: exeext3.test
PASS: exdir3.test
PASS: exsource.test
PASS: ext.test
PASS: exeext2.test
PASS: ext2.test
PASS: distcheck-missing-m4.test
PASS: dollarvar2.test
PASS: extra.test
PASS: exeext.test
PASS: extra2.test
PASS: extra-portability2.test
PASS: exeext4.test
PASS: extra3.test
PASS: extra-portability3.test
PASS: extra4.test
PASS: extra8.test
PASS: extra5.test
PASS: extra7.test
PASS: extra6.test
PASS: extra10.test
PASS: extra11.test
PASS: extra12.test
PASS: f90only.test
PASS: flibs.test
PASS: fnoc.test
PASS: distcheck-outdated-m4.test
PASS: fo.test
PASS: forcemiss.test
PASS: extra-portability.test
PASS: forcemiss2.test
SKIP: fort4.test
PASS: fort1.test
SKIP: fort5.test
PASS: fn99.test
PASS: fort2.test
PASS: fonly.test
PASS: fortdep.test
SKIP: gcj4.test
PASS: gcj.test
SKIP: gcj6.test
SKIP: gettext-macros.test
PASS: gcj2.test
PASS: gcj3.test
PASS: gcj5.test
PASS: extradep.test
PASS: gnuwarn2.test
PASS: gnits.test
PASS: hdr-vars-defined-once.test
PASS: fn99subdir.test
PASS: gnuwarn.test
PASS: help.test
PASS: header.test
PASS: help2.test
PASS: help4.test
PASS: help3.test
PASS: gnumake.test
PASS: gnits2.test
PASS: help-depend.test
PASS: help-depend2.test
PASS: help-dmalloc.test
PASS: help-init.test
PASS: help-lispdir.test
PASS: help-multilib.test
PASS: help-python.test
PASS: help-regex.test
PASS: gnits3.test
PASS: help-upc.test
PASS: init.test
PASS: implicit.test
PASS: info.test
PASS: help-silent.test
PASS: init2.test
PASS: insh2.test
SKIP: install2.test
PASS: installdir.test
PASS: instsh3.test
PASS: instsh.test
PASS: hfs.test
PASS: instdat.test
PASS: instsh2.test
SKIP: instdir-java.test
PASS: instdat2.test
SKIP: instdir-lisp.test
PASS: extradep2.test
PASS: hosts.test
SKIP: instdir-python.test
SKIP: instdir-texi.test
PASS: install-info-dir.test
PASS: instexec.test
SKIP: instfail-java.test
PASS: instdir.test
PASS: instdir2.test
SKIP: instfail-info.test
PASS: instman.test
PASS: instman2.test
PASS: instdir-prog.test
SKIP: instmany-python.test
SKIP: instfail.test
PASS: interp.test
PASS: interp2.test
SKIP: java.test
PASS: insthook.test
SKIP: instmany.test
SKIP: java-check.test
PASS: java2.test
SKIP: java-empty-classpath.test
PASS: instdir-ltlib.test
SKIP: instspc.test
SKIP: java-clean.test
SKIP: java-nobase.test
SKIP: java-compile-install.test
PASS: javaprim.test
PASS: javasubst.test
PASS: javadir-undefined.test
PASS: java3.test
PASS: java-no-duplicate.test
SKIP: instmany-mans.test
PASS: flavor.test
SKIP: lex3.test
PASS: ldadd.test
SKIP: lex5.test
SKIP: lex-subobj-nodep.test
PASS: lex.test
PASS: java-sources.test
PASS: ldflags.test
PASS: lex2.test
PASS: lex4.test
PASS: java-mix.test
PASS: libexec.test
PASS: libobj2.test
PASS: libobj3.test
PASS: libobj4.test
PASS: libobj5.test
PASS: libobj7.test
PASS: libobj8.test
PASS: libobj11.test
SKIP: instfail-libtool.test
PASS: libobj10.test
PASS: lflags2.test
PASS: libobj14.test
PASS: library.test
PASS: library2.test
PASS: lflags.test
PASS: library3.test
PASS: libobj13.test
PASS: libtool.test
PASS: libtool2.test
PASS: libobj12.test
PASS: libtool4.test
PASS: libtool5.test
PASS: libtool6.test
PASS: libtool8.test
PASS: link_c_cxx.test
PASS: license2.test
PASS: link_dist.test
PASS: link_f90_only.test
PASS: link_fc.test
PASS: link_fccxx.test
PASS: link_fcxx.test
PASS: link_f_only.test
SKIP: lisp3.test
SKIP: lisp4.test
SKIP: lisp5.test
SKIP: lisp6.test
PASS: license.test
SKIP: lisp8.test
SKIP: lispdry.test
PASS: libtool7.test
PASS: listval.test
PASS: libtool9.test
PASS: lisp2.test
PASS: location.test
PASS: longline.test
PASS: lisp7.test
PASS: longlin2.test
PASS: ltdeps.test
PASS: ltinstloc.test
PASS: libtool3.test
PASS: ltlibobjs.test
PASS: libtoo11.test
SKIP: lzip.test
PASS: libtoo10.test
PASS: ltcond.test
PASS: ltcond2.test
PASS: m4-inclusion.test
FAIL: lzma.test
PASS: ltconv.test
PASS: maintclean.test
PASS: maintmode-configure-msg.test
PASS: maintclean-vpath.test
PASS: makefile-deps.test
PASS: ltinit.test
PASS: maken.test
PASS: makej2.test
PASS: makevars.test
PASS: man.test
PASS: makej.test
PASS: ltorder.test
PASS: mdate.test
PASS: man2.test
PASS: make.test
PASS: maken3.test
PASS: mdate2.test
PASS: mdate3.test
PASS: mdate6.test
PASS: man5.test
PASS: mdate4.test
PASS: missing3.test
PASS: mdate5.test
PASS: man4.test
PASS: man3.test
PASS: mkinstall.test
PASS: missing5.test
PASS: mkinst3.test
PASS: ltlibsrc.test
PASS: mkinst2.test
PASS: missing4.test
PASS: missing6.test
SKIP: nobase-python.test
PASS: missing2.test
PASS: missing.test
PASS: mmodely.test
PASS: nobase-nodist.test
PASS: nodep.test
PASS: nodep2.test
PASS: nodepcomp.test
PASS: nodef.test
PASS: nodist.test
PASS: mmode.test
PASS: nobase.test
PASS: nodef2.test
PASS: nodist3.test
PASS: noinst.test
PASS: nolink.test
PASS: noinstdir.test
PASS: nodist2.test
PASS: nogzip2.test
PASS: number.test
PASS: objc.test
PASS: objc2.test
PASS: order.test
PASS: nogzip.test
PASS: obsolete.test
PASS: outdir.test
PASS: notrans.test
PASS: output.test
XFAIL: objext-pr10128.test
PASS: output2.test
PASS: output3.test
PASS: output4.test
PASS: output5.test
PASS: nostdinc.test
PASS: output6.test
PASS: output8.test
PASS: output7.test
PASS: output10.test
PASS: output9.test
PASS: output13.test
PASS: nobase-libtool.test
PASS: overrid.test
PASS: output11.test
SKIP: parallel-tests2.test
PASS: output12.test
PASS: output-order.test
PASS: parallel-tests4.test
PASS: parallel-tests.test
PASS: multlib.test
PASS: parallel-am.test
PASS: parallel-tests3.test
PASS: parallel-am3.test
PASS: parallel-am2.test
PASS: parallel-tests6.test
PASS: parallel-tests10.test
PASS: parallel-tests9.test
PASS: parallel-tests-dryrun.test
SKIP: parallel-tests-unreadable-log.test
PASS: parallel-tests7.test
SKIP: parallel-tests-log-compiler-example.test
PASS: parallel-tests-subdir.test
PASS: parallel-tests-log-override-2.test
PASS: parallel-tests-log-override-recheck.test
PASS: parallel-tests5.test
PASS: parse.test
PASS: test-extensions.test
PASS: test-extensions-cond.test
PASS: percent.test
PASS: parallel-tests8.test
PASS: parallel-tests-log-override-1.test
PASS: phony.test
PASS: parallel-tests-harderror.test
PASS: pluseq.test
PASS: percent2.test
PASS: pluseq2.test
PASS: pluseq3.test
PASS: pluseq4.test
PASS: pluseq6.test
PASS: pluseq8.test
PASS: pluseq7.test
PASS: pluseq9.test
PASS: pluseq5.test
PASS: ppf77.test
SKIP: pr204.test
PASS: pr72.test
PASS: pluseq10.test
PASS: pluseq11.test
PASS: pr2.test
PASS: pr211.test
PASS: pr229.test
PASS: postproc.test
PASS: pr279.test
PASS: pr9.test
PASS: pr220.test
PASS: pr279-2.test
PASS: pr224.test
PASS: pr243.test
PASS: pr266.test
PASS: pr300-lib.test
PASS: pr87.test
PASS: pr300-prog.test
PASS: pr287.test
PASS: prefix.test
PASS: primary.test
PASS: primary2.test
PASS: primary-prefix-valid-couples.test
PASS: primary3.test
PASS: pr300-ltlib.test
PASS: primary-prefix-couples-documented-valid.test
SKIP: py-compile-basic.test
SKIP: py-compile-basic2.test
SKIP: py-compile-basedir.test
SKIP: py-compile-destdir.test
PASS: proginst.test
PASS: primary-prefix-invalid-couples.test
PASS: pr307.test
PASS: py-compile-env.test
SKIP: py-compile-option-terminate.test
SKIP: python3.test
PASS: py-compile-usage.test
PASS: python.test
PASS: python4.test
PASS: python5.test
SKIP: python8.test
SKIP: python9.test
SKIP: python10.test
PASS: python6.test
SKIP: python12.test
PASS: primary-prefix-couples-force-valid.test
PASS: python7.test
PASS: recurs.test
PASS: recurs2.test
PASS: python11.test
PASS: remake.test
PASS: remake2.test
PASS: remake3.test
PASS: python2.test
PASS: remake4.test
PASS: remake-subdir-from-subdir.test
PASS: remake7.test
PASS: remake6.test
PASS: remake5.test
PASS: pr401.test
XFAIL: remake-am-pr10111.test
PASS: remake-subdir-gnu.test
PASS: remake-subdir.test
XFAIL: remake-m4-pr10111.test
PASS: remake-subdir2.test
PASS: remake-deleted-am.test
PASS: remake-subdir-long-time.test
PASS: regex-obsolete.test
PASS: req.test
PASS: pr401c.test
PASS: reqd.test
XFAIL: pr8365-remake-timing.test
PASS: remake-deleted-am-2.test
PASS: remake-renamed-am.test
PASS: rulepat.test
PASS: scripts.test
PASS: remake-deleted-am-subdir.test
PASS: reqd2.test
PASS: regex.test
PASS: seenc.test
PASS: sanity.test
PASS: silent2.test
PASS: silent.test
PASS: silent7.test
PASS: silentf77.test
SKIP: silent-many-gcc.test
SKIP: silent-many-generic.test
SKIP: silent-lex-gcc.test
SKIP: silent-lex-generic.test
PASS: silentf90.test
SKIP: silent-yacc-gcc.test
SKIP: silent-yacc-generic.test
PASS: silent6.test
PASS: silent9.test
PASS: srcsub.test
PASS: silent4.test
PASS: silent3.test
PASS: space.test
PASS: srcsub2.test
PASS: specflg.test
PASS: silentcxx.test
PASS: specflg3.test
PASS: specflg2.test
PASS: specflg6.test
PASS: specflg9.test
PASS: silent-nested-vars.test
PASS: spell.test
PASS: spell2.test
PASS: specflg8.test
PASS: specflg7.test
PASS: specflg-dummy.test
PASS: spell3.test
PASS: spelling.test
PASS: stdlib.test
PASS: spy.test
PASS: pr401b.test
PASS: silent-configsite.test
PASS: stamph2.test
PASS: subdir.test
PASS: subdir2.test
PASS: subdir3.test
PASS: strip.test
PASS: subdir4.test
PASS: strip2.test
PASS: stdinc.test
PASS: stdlib2.test
PASS: subdir7.test
PASS: subdir6.test
SKIP: subcond.test
PASS: specflg10.test
PASS: subdir10.test
PASS: subdir9.test
PASS: subobj.test
PASS: subobj2.test
PASS: strip3.test
PASS: subdirbuiltsources.test
PASS: subobj4.test
PASS: subobj7.test
PASS: subobj8.test
PASS: subobj3.test
PASS: subdir5.test
PASS: subobj5.test
PASS: subcond2.test
PASS: subdir8.test
PASS: subobj11b.test
PASS: subobj11c.test
PASS: subobj6.test
PASS: subcond3.test
PASS: subobjname.test
SKIP: subpkg-yacc.test
PASS: subst.test
PASS: subobj10.test
PASS: subpkg4.test
PASS: subst2.test
PASS: subst4.test
PASS: subobj11a.test
PASS: subpkg2.test
PASS: substref.test
PASS: subpkg3.test
PASS: suffix3.test
PASS: substtarg.test
PASS: suffix2.test
PASS: suffix.test
PASS: suffix4.test
PASS: suffix6.test
PASS: substre2.test
PASS: suffix5.test
SKIP: suffix10.test
PASS: suffix7.test
PASS: subpkg.test
PASS: symlink.test
SKIP: symlink2.test
PASS: suffix9.test
PASS: syntax.test
PASS: tags.test
PASS: subst3.test
SKIP: tagsub.test
PASS: suffix12.test
PASS: suffix11.test
PASS: tar3.test
PASS: subobj9.test
PASS: targetclash.test
PASS: suffix8.test
PASS: tar2.test
PASS: tar.test
SKIP: txinfo3.test
PASS: txinfo.test
XFAIL: txinfo5.test
PASS: txinfo4.test
PASS: tar-override.test
PASS: txinfo2.test
PASS: txinfo5b.test
PASS: txinfo6.test
SKIP: txinfo13.test
SKIP: txinfo16.test
SKIP: txinfo18.test
SKIP: txinfo19.test
PASS: txinfo7.test
SKIP: txinfo21.test
SKIP: txinfo22.test
SKIP: txinfo23.test
PASS: txinfo9.test
SKIP: txinfo24.test
SKIP: txinfo25.test
PASS: txinfo10.test
SKIP: txinfo28.test
PASS: target-cflags.test
PASS: txinfo17.test
PASS: txinfo8.test
PASS: txinfo31.test
SKIP: txinfo33.test
PASS: txinfo27.test
PASS: txinfo20.test
PASS: txinfo30.test
SKIP: uninstall-fail.test
PASS: txinfo29.test
PASS: unused.test
PASS: txinfo26.test
PASS: txinfo32.test
PASS: upc2.test
PASS: transform.test
SKIP: vala2.test
PASS: uninstall-pr9578.test
SKIP: vala3.test
PASS: vala.test
SKIP: vala5.test
SKIP: vala-vpath.test
PASS: suffix13.test
SKIP: vala-mix.test
PASS: vala1.test
PASS: vars.test
PASS: vartar.test
SKIP: upc.test
PASS: version.test
SKIP: upc3.test
SKIP: version7.test
PASS: version8.test
PASS: version2.test
PASS: version3.test
PASS: version4.test
PASS: version6.test
PASS: vars3.test
SKIP: vtexi4.test
PASS: vpath.test
PASS: vtexi.test
PASS: vtexi2.test
PASS: whoami.test
PASS: werror.test
PASS: transform2.test
PASS: xsource.test
PASS: warnopts.test
PASS: yacc.test
SKIP: yacc4.test
PASS: werror3.test
SKIP: yacc6.test
SKIP: yacc7.test
SKIP: yacc8.test
SKIP: yaccdry.test
PASS: vtexi3.test
SKIP: yaccvpath.test
SKIP: yacc-dist-nobuild-subdir.test
PASS: yaccpp.test
PASS: werror2.test
PASS: xz.test
PASS: yacc5.test
PASS: yacc3.test
PASS: yacc2.test
PASS: yflags2.test
PASS: yflags.test
PASS: check-exported-srcdir-p.test
SKIP: check12-p.test
PASS: check-p.test
PASS: check-tests_environment-p.test
PASS: check-concurrency-bug9245-p.test
PASS: check11-p.test
PASS: check-tests-in-builddir-p.test
PASS: check2-p.test
PASS: check3-p.test
PASS: check4-p.test
PASS: check10-p.test
SKIP: color2-p.test
PASS: check5-p.test
PASS: comment9-p.test
PASS: vala4.test
PASS: dejagnu-p.test
PASS: color-p.test
PASS: ar-lib6a.test
PASS: ar-lib6b.test
SKIP: gettext.test
SKIP: gettext2.test
PASS: check6-p.test
SKIP: gettext3.test
PASS: ar-lib4.test
PASS: check7-p.test
PASS: check8-p.test
PASS: check9-p.test
PASS: exeext4-p.test
PASS: maken3-p.test
1 of 820 tests failed
(117 tests were not run)
See tests/test-suite.log
Please report to address@hidden
make[3]: *** [test-suite.log] Error 1
make[3]: Leaving directory `/home/peda/automake-1.11.2b/tests'
make[2]: *** [check-TESTS] Error 2
make[2]: Leaving directory `/home/peda/automake-1.11.2b/tests'
make[1]: *** [check-am] Error 2
make[1]: Leaving directory `/home/peda/automake-1.11.2b/tests'
make: *** [check-recursive] Error 1

reply via email to

[Prev in Thread] Current Thread [Next in Thread]