[Top][All Lists]

[Date Prev][Date Next][Thread Prev][Thread Next][Date Index][Thread Index]

axiom installation failed

From: tws
Subject: axiom installation failed
Date: Wed, 5 May 2021 21:31:29 +0200
User-agent: Mozilla/5.0 (Macintosh; Intel Mac OS X 10.15; rv:78.0) Gecko/20100101 Thunderbird/78.10.1

I would like to test axiom. In particular the Risch algorithm

In home/tws/axiom, I used

sudo ./configure
export AXIOM=/home/tws/axiom/mnt/macosxppc
export PATH=$AXIOM/bin:$PATH
sudo make AWK=awk

1 error generated.
make[3]: *** [/Users/gg/home/tws/axiom/obj//lib/cfuns-c.o] Error 1
make[2]: *** [unixport/saved_pre_gcl] Error 2
/bin/sh: unixport/saved_gcl: No such file or directory
make[1]: *** [gcldir] Error 127
make: *** [lspdir] Error 2

Can you help me, as I am not an experienced user of system commands?


Theodor Schlickmann

reply via email to

[Prev in Thread] Current Thread [Next in Thread]