[Top][All Lists]

[Date Prev][Date Next][Thread Prev][Thread Next][Date Index][Thread Index]

bug#11097: Testing automake

From: Rob Hoveling
Subject: bug#11097: Testing automake
Date: Mon, 26 Mar 2012 10:16:16 +0200

'make check':

FAIL: instsh.test
FAIL: location.test
FAIL: warnopts.test

3 of 672 tests failed
(57 tests were not run)
See tests/test-suite.log
Please report to address@hidden
make[3]: *** [test-suite.log] Error 1
make[2]: *** [check-TESTS] Error 2
make[1]: *** [check-am] Error 2
make: *** [check-recursive] Error 1

Attachment: test-suite.log
Description: Binary data

reply via email to

[Prev in Thread] Current Thread [Next in Thread]