[Top][All Lists]

[Date Prev][Date Next][Thread Prev][Thread Next][Date Index][Thread Index]

problem compiling bison 2.1

From: Jon Schewe
Subject: problem compiling bison 2.1
Date: Tue, 31 Jan 2006 12:56:04 -0600

I'm attempting to compile bision 2.1 on solaris 2.6 and finding that the
Makefile appears to refer to src/bison to build src/bison.  Can someone
explain what's supposed to be happening here?

Making all in src
make[2]: Entering directory
../tests/bison -y  "-dv" parse-gram.y
  not found
make[2]: *** [parse-gram.c] Error 127
make[2]: Leaving directory
make[1]: *** [all-recursive] Error 1
make[1]: Leaving directory
make: *** [all] Error 2


http://lug.htc.honeywell.com/people/jschewe [Honeywell Intranet Only]
*My views may not represent those of my employers

Attachment: smime.p7s
Description: S/MIME cryptographic signature

reply via email to

[Prev in Thread] Current Thread [Next in Thread]