[Top][All Lists]

[Date Prev][Date Next][Thread Prev][Thread Next][Date Index][Thread Index]

Re: Bison 3.7.1 released

From: Dennis Clarke
Subject: Re: Bison 3.7.1 released
Date: Thu, 13 Aug 2020 04:49:30 -0400
User-agent: Mozilla/5.0 (X11; Linux x86_64; rv:78.0) Gecko/20100101 Thunderbird/78.0.1

On 8/3/20 1:51 AM, Akim Demaille wrote:
>> Le 3 août 2020 à 05:18, Richard Stallman <rms@gnu.org> a écrit :
>> Condolences on the new release ;-{.
> Exactly :)  And unfortunately I already know there will be more bug fix 
> releases :(

I was surprised to see :

/opt/developerstudio12.6/bin/CC -std=c++11 -std=c++11  -m64 -xarch=sparc
-dalign -erroff=%none -errtags=yes -ftrap=%none -g -xcode=pic32 -m64 -mc
-xunroll=1 -xbuiltin=%none -xdepend=no -xnolibmopt -xlinkopt=0
-xnolibmil -xregs=no%appl -xs -D_TS_ERRNO -D_POSIX_PTHREAD_SEMANTICS
-D_LARGEFILE64_SOURCE  -L/opt/bw/lib -o examples/c++/variant-11
examples/c++/variant_11-variant-11.o  -lrt
build-aux/install-sh -c -d examples/java/calc
./tests/bison ./examples/java/calc/Calc.y -o examples/java/calc/Calc.java
bison: extra operand '-o'
Try 'bison --help' for more information.
gmake[3]: *** [Makefile:10556: examples/java/calc/Calc.java] Error 1
gmake[3]: Leaving directory
gmake[2]: *** [Makefile:9503: check-am] Error 2
gmake[2]: Leaving directory
gmake[1]: *** [Makefile:9054: check-recursive] Error 1
gmake[1]: Leaving directory
gmake: *** [Makefile:9506: check] Error 2

So that is strange as that doesn't even exist in the 3.6.91 beta.

Dennis Clarke
UNIX and Linux spoken
GreyBeard and suspenders optional

reply via email to

[Prev in Thread] Current Thread [Next in Thread]