[Top][All Lists]
[Date Prev][Date Next][Thread Prev][Thread Next][Date Index][Thread Index]
coreutils-6.3: install: basic-1 fails
From: |
Bauke Jan Douma |
Subject: |
coreutils-6.3: install: basic-1 fails |
Date: |
Tue, 03 Oct 2006 18:38:49 +0200 |
User-agent: |
Thunderbird 1.5.0.7 (X11/20060909) |
$> who am i
root pts/3 Oct 3 17:38 (:0.0)
$> uname -a
Linux skyscraper 2.6.18 #3 PREEMPT Wed Sep 27 21:02:18 CEST 2006 i686 GNU/Linux
$> RUN_VERY_EXPENSIVE_TESTS=yes make check
...
Making check in install
make[2]: Entering directory `/sw/coreutils/coreutils-6.3/tests/install'
make check-TESTS
make[3]: Entering directory `/sw/coreutils/coreutils-6.3/tests/install'
PASS: trap
cp: cannot open `/sw/coreutils/coreutils-6.3/tests/install/../../src/dd' for reading:
Permission denied
cp: cannot stat `dd': No such file or directory
strip: 'dd2': No such file
ginstall: cannot stat `dd': No such file or directory
ls: cannot access dir/dd: No such file or directory
FAIL: basic-1
PASS: create-leading
PASS: d-slashdot
======================================
1 of 4 tests failed
Please report to address@hidden
======================================
make[3]: *** [check-TESTS] Error 1
make[3]: Leaving directory `/sw/coreutils/coreutils-6.3/tests/install'
make[2]: *** [check-am] Error 2
make[2]: Leaving directory `/sw/coreutils/coreutils-6.3/tests/install'
make[1]: *** [check-recursive] Error 1
make[1]: Leaving directory `/sw/coreutils/coreutils-6.3/tests'
make: *** [check-recursive] Error 1
bj
- coreutils-6.3: install: basic-1 fails,
Bauke Jan Douma <=