[Top][All Lists]

[Date Prev][Date Next][Thread Prev][Thread Next][Date Index][Thread Index]

4.2.28 compilation fails on Solaris 9

From: Zube
Subject: 4.2.28 compilation fails on Solaris 9
Date: Mon, 14 Aug 2006 06:59:25 -0600
User-agent: Mutt/1.5.12-2006-07-14


Solaris 9, fully patched
gcc 3.4.5

regex.c, where these functions are defined, doesn't seem to be compiled 
into libgnulib.a.


gcc  -O2   -o find  find.o fstype.o parser.o pred.o tree.o util.o version.o 
../lib/libfind.a ../gnulib/lib/libgnulib.a
Undefined                       first referenced
 symbol                             in file
re_compile_pattern                  parser.o
re_match                            pred.o
re_set_syntax                       parser.o
ld: fatal: Symbol referencing errors. No output written to find
collect2: ld returned 1 exit status
gmake[3]: *** [find] Error 1
gmake[3]: Leaving directory `/stat/src/findutils/findutils-4.2.28/find'
gmake[2]: *** [all-recursive] Error 1
gmake[2]: Leaving directory `/stat/src/findutils/findutils-4.2.28/find'
gmake[1]: *** [all-recursive] Error 1
gmake[1]: Leaving directory `/stat/src/findutils/findutils-4.2.28'
gmake: *** [all] Error 2


reply via email to

[Prev in Thread] Current Thread [Next in Thread]