[Top][All Lists]

[Date Prev][Date Next][Thread Prev][Thread Next][Date Index][Thread Index]

[bug #57762] Test fail of find.posix/sv-bug-54171.exp

From: Yang
Subject: [bug #57762] Test fail of find.posix/sv-bug-54171.exp
Date: Fri, 7 Feb 2020 03:10:13 -0500 (EST)
User-agent: Mozilla/5.0 (Windows NT 10.0; Win64; x64) AppleWebKit/537.36 (KHTML, like Gecko) Chrome/75.0.3770.142 Safari/537.36


                 Summary: Test fail of find.posix/sv-bug-54171.exp
                 Project: findutils
            Submitted by: syyhao
            Submitted on: Fri 07 Feb 2020 08:10:11 AM UTC
                Category: None
                Severity: 3 - Normal
              Item Group: Test suite failure
                  Status: None
                 Privacy: Public
             Assigned to: None
         Originator Name: 
        Originator Email: 
             Open/Closed: Open
         Discussion Lock: Any
                 Release: 4.7.0
           Fixed Release: None



Description of problem:
When i use rpmbuild to build findutils of 4.7.0 as root, the test failed,
FAIL: sv-bug-54171.old-O3,
FAIL: sv-bug-54171.new-O3,
If i change to non-root user, the building succeded.

Version-Release number of selected component (if applicable):
The version of findutils is 4.7.0

Steps to Reproduce:
 1.[root@localhost findutils]# rpmbuild -ba findutils.spec

> > 
> > Actual results:

Running ../../../find/testsuite/find.posix/sv-bug-54171.exp ...
FAIL: sv-bug-54171.old-O3,
FAIL: sv-bug-54171.new-O3,

                === find Summary ===

# of expected passes            943
# of unexpected failures        2
# of untested testcases         2
find (GNU findutils) 4.7.0
make[3]: *** [Makefile:1942: check-DEJAGNU] Error 1
make[3]: Leaving directory
make[2]: *** [Makefile:2017: check-am] Error 2
make[2]: Leaving directory
make[1]: *** [Makefile:2008: check-recursive] Error 1
make[1]: Leaving directory '/root/rpmbuild/BUILD/findutils-4.7.0/build/find'
make: *** [Makefile:2109: check-recursive] Error 1
make: Leaving directory '/root/rpmbuild/BUILD/findutils-4.7.0/build'
error: Bad exit status from /var/tmp/rpm-tmp.x9ibSi (%check)

RPM build errors:
    Bad exit status from /var/tmp/rpm-tmp.x9ibSi (%check)

 Expected results:
 Building success.


Reply to this item at:


  Message sent via Savannah

reply via email to

[Prev in Thread] Current Thread [Next in Thread]