[Top][All Lists]

[Date Prev][Date Next][Thread Prev][Thread Next][Date Index][Thread Index]

bug#7998: windows build failure

From: Glenn Morris
Subject: bug#7998: windows build failure
Date: Mon, 07 Feb 2011 18:41:26 -0500
User-agent: Gnus (www.gnus.org), GNU Emacs (www.gnu.org/software/emacs/)

Sean Sieger wrote:

> Run "gmake getopt_h" in the lib/ subdirectory.
> You will need GNU Sed to be installed.
> exit -1
> make[2]: *** [getopt_.h-CMD] Error -1
> make[2]: Leaving directory `c:/emacs-24.0.50/lib'
> make[1]: *** [getopt_.h] Error 2
> make[1]: Leaving directory `c:/emacs-24.0.50/lib'
> make: *** [bootstrap-gmake] Error 2
> Um, sed's in my path,

Um, so try running "gmake getopt_h" in the lib/ subdirectory then.

(see also
http://lists.gnu.org/archive/html/emacs-devel/2011-02/msg00278.html )

reply via email to

[Prev in Thread] Current Thread [Next in Thread]