[Top][All Lists]

[Date Prev][Date Next][Thread Prev][Thread Next][Date Index][Thread Index]

bug#29280: 26.0.90+27.0.50; Invalid function: load

From: Katsumi Yamaoka
Subject: bug#29280: 26.0.90+27.0.50; Invalid function: load
Date: Mon, 13 Nov 2017 09:13:43 +0900
User-agent: Gnus/5.13 (Gnus v5.13) Emacs/26.0.90 (i686-pc-cygwin)


Is it just me, or Cygwin specific?  Both master and emacs-26
bootstrap failed since last week.

./temacs --batch  --load loadup bootstrap
Invalid function: load
make[2]: *** [Makefile:738: bootstrap-emacs.exe] Error 255
make[2]: Leaving directory '/Work/emacs/src'
make[1]: *** [Makefile:416: src] Error 2
make[1]: Leaving directory '/Work/emacs'
make: *** [GNUmakefile:79: bootstrap] Error 2

$ ./src/temacs.exe
Invalid function: load


In GNU Emacs 26.0.90 (build 1, i686-pc-cygwin, GTK+ Version 3.18.9)
 of 2017-11-06 built on localhost
Windowing system distributor 'The Cygwin/X Project', version 11.0.11900000

reply via email to

[Prev in Thread] Current Thread [Next in Thread]