[Top][All Lists]

[Date Prev][Date Next][Thread Prev][Thread Next][Date Index][Thread Index]

error compiling tar-1.18 on IRIX

From: Noam G. Nudelman
Subject: error compiling tar-1.18 on IRIX
Date: Sun, 1 Jul 2007 07:49:18 +0300 (IDT)


  When trying to compile tar-1.18 on IRIX 6.5, I get the following error:

In file included from ./stdint.h:71,
                 from /usr/include/inttypes.h:242,
                 from ./inttypes.h:31,
                 from xstrtol.h:25,
                 from xstrtol.c:32,
                 from xstrtoumax.c:6:
./inttypes.h:44:3: #error "This file assumes that 'int' has exactly 32 bits.
Please report your platform and compiler to <address@hidden>."
gmake[3]: *** [xstrtoumax.o] Error 1
gmake[3]: Leaving directory `./tar-1.18/lib'
gmake[2]: *** [all] Error 2
gmake[2]: Leaving directory `./tar-1.18/lib'
gmake[1]: *** [all-recursive] Error 1
gmake[1]: Leaving directory `./tar-1.18'
gmake: *** [all] Error 2

Noam G. Nudelman
Head of Open System Section 
Center for IT Infrastructure & IS
Bar-Ilan University
Ramat-Gan 52900, Israel
Tel: +972-3-5318558

reply via email to

[Prev in Thread] Current Thread [Next in Thread]