[Top][All Lists]

[Date Prev][Date Next][Thread Prev][Thread Next][Date Index][Thread Index]

Re: recent gstep-core doesn't compile.

From: Mohammad A. Haque
Subject: Re: recent gstep-core doesn't compile.
Date: Wed, 15 Nov 2000 07:58:59 -0500

I reported this on the help list last week but didnt get a response. I
checked out cvs on two machines and got the same results.

Andreas Fuchs wrote:
> Hi,
> the recent CVS gstep core does not compile correctly. I used the rules
> script in the debian directory of the tree (I use debian woody); no
> configure script complained about missing libs.
> This is the error message that I get:
> ----cut-----
> Making all for svc example...
> Uncaught exception NSInvalidArgumentException, reason: No resource name 
> specified.
> make[4]: *** [before-example-all] Error 134
> make[3]: *** [example.build] Error 2
> make[2]: *** [example.all.svc.variables] Error 2
> make[2]: Leaving directory `/home/asf/dl/cvs/gstep/core/gui/Tools'
> make[1]: *** [internal-all] Error 2
> make[1]: Leaving directory `/home/asf/dl/cvs/gstep/core/gui'
> make: *** [subproj-all] Error 2
> ----cut-----
> I also tried building without the rules script and the build failed
> again.
> When replying to this message, please Cc: me as I'm not subscribed to
> this list.


Mohammad A. Haque                              http://www.haque.net/ 

  "Alcohol and calculus don't mix.             Project Lead
   Don't drink and derive." --Unknown          http://wm.themes.org/

reply via email to

[Prev in Thread] Current Thread [Next in Thread]