[Top][All Lists]

[Date Prev][Date Next][Thread Prev][Thread Next][Date Index][Thread Index]

Compile GNUstep-base failed

From: Yen-Ju Chen
Subject: Compile GNUstep-base failed
Date: Tue, 7 May 2002 17:43:51 -0400

  It stoped at NSBundle.

In file included from NSBundle.m:35:
../Headers/Foundation/objc-load.h:15:16: #if with no expression
gmake[2]: *** [shared_obj/ix86/freebsd/gnu-gnu-gnu/NSBundle.o] Error 1
gmake[1]: *** [libgnustep-base.all.library.variables] Error 2
gmake[1]: Leaving directory `/root/gnustep/core/base/Source'
gmake: *** [internal-all] Error 2

  I attached my output of ./configure and gmake, and the config.log

  There is another warning which I never met before when ./configure:
  configure: WARNING: sys/mount.h: present but cannot be compiled
  configure: WARNING: sys/mount.h: check for missing prerequisite headers?
  configure: WARNING: sys/mount.h: proceeding with the preprocessor's result

  Have no idea whethere they are related.

  I use FreeBSD 4.5, GCC 3.0, and just upgrade to XFree86 4.2.0 via
  The source code comes from CVS.


Attachment: config.log
Description: Binary data

Attachment: gmake.outfile
Description: Binary data

Attachment: configure.outfile
Description: Binary data

reply via email to

[Prev in Thread] Current Thread [Next in Thread]