[Top][All Lists]

[Date Prev][Date Next][Thread Prev][Thread Next][Date Index][Thread Index]

Compile GNUstep-base failed at NSTask

From: Yen-Ju Chen
Subject: Compile GNUstep-base failed at NSTask
Date: Wed, 8 May 2002 10:55:21 -0400

  Another problm from lastest CVS (11AM EST)
NSTask.m: In function `-[NSConcreteUnixTask setStandard]':
NSTask.m:1365: parse error before '[' token
NSTask.m:1372: `hdl' undeclared (first use in this function)
NSTask.m:1372: (Each undeclared identifier is reported only once
NSTask.m:1372: for each function it appears in.)
gmake[2]: *** [shared_obj/ix86/freebsd/gnu-gnu-gnu/NSTask.o] Error 1
gmake[1]: *** [libgnustep-base.all.library.variables] Error 2
gmake[1]: Leaving directory `/root/gnustep/core/base/Source'
gmake: *** [internal-all] Error 2


  PS. The output of gmake is attached

Attachment: gmake.outfile
Description: Binary data

reply via email to

[Prev in Thread] Current Thread [Next in Thread]