[Top][All Lists]

[Date Prev][Date Next][Thread Prev][Thread Next][Date Index][Thread Index]

[bugs #9187] Problem compiling gnustep-base 1.9.1

From: Pierre
Subject: [bugs #9187] Problem compiling gnustep-base 1.9.1
Date: Wed, 02 Jun 2004 09:59:19 -0400
User-agent: Mozilla/5.0 (X11; U; Linux i686; en-US; rv:1.7) Gecko/20040514

This mail is an automated notification from the bugs tracker
 of the project: GNUstep.

[bugs #9187] Full Item Snapshot:

URL: <http://savannah.gnu.org/bugs/?func=detailitem&item_id=9187>
Project: GNUstep
Submitted by: Pierre
On: mer 02.06.2004 à 13:58

Category:  Base/Foundation
Severity:  5 - Average
Item Group:  Installation
Resolution:  None
Assigned to:  None
Status:  Open

Summary:  Problem compiling gnustep-base 1.9.1

Original Submission:  [...]
Making all in Tools...
gmake[1]: Entering directory `/tmp/gnustep-base-1.9.1/Tools'
Making all for tool autogsdoc...
 Linking tool autogsdoc ...
/usr/lib/crt1.o(.text+0x18): In function `_start':
: undefined reference to `main'
collect2: ld returned 1 exit status
gmake[2]: *** [shared_obj/autogsdoc] Error 1
gmake[1]: *** [autogsdoc.all.tool.variables] Error 2
gmake[1]: Leaving directory `/tmp/gnustep-base-1.9.1/Tools'
gmake: *** [internal-all] Error 2

For detailed info, follow this link:

  Message sent via/by Savannah

reply via email to

[Prev in Thread] Current Thread [Next in Thread]