bug-gnustep
[Top][All Lists]
Advanced

[Date Prev][Date Next][Thread Prev][Thread Next][Date Index][Thread Index]

[bug #14058] compile error


From: YunSong Hwang
Subject: [bug #14058] compile error
Date: Sun, 7 Aug 2005 07:52:04 +0000
User-agent: Opera/8.10 (X11; Linux i686; U; ko)

URL:
  <http://savannah.gnu.org/bugs/?func=detailitem&item_id=14058>

                 Summary: compile error
                 Project: GNUstep
            Submitted by: hys545
            Submitted on: 일 2005년 08월 07일   07:52
                Category: Gorm
                Severity: 3 - Normal
              Item Group: None
                  Status: None
                 Privacy: Public
             Assigned to: None
             Open/Closed: Open

    _______________________________________________________

Details:

Copying resources into the palette wrapper...
make[2]: Leaving directory
`/home/hys545/work/gnustep/gnustep/dev-apps/Gorm/Palettes/0Menus'
Making all in 1Windows...
make[2]: Entering directory
`/home/hys545/work/gnustep/gnustep/dev-apps/Gorm/Palettes/1Windows'
Making all for palette 1Windows...
make[3]: *** No rule to make target `shared_obj/inspectors.o', needed by
`1Windows.palette/./1Windows'.  Stop.
make[2]: *** [1Windows.all.palette.variables] Error 2
make[2]: Leaving directory
`/home/hys545/work/gnustep/gnustep/dev-apps/Gorm/Palettes/1Windows'
make[1]: *** [internal-all] Error 2
make[1]: Leaving directory
`/home/hys545/work/gnustep/gnustep/dev-apps/Gorm/Palettes'
make: *** [internal-all] Error 2
address@hidden Gorm]#      

I use cvs-2005-8-7                      






    _______________________________________________________

Reply to this item at:

  <http://savannah.gnu.org/bugs/?func=detailitem&item_id=14058>

_______________________________________________
  Message sent via/by Savannah
  http://savannah.gnu.org/





reply via email to

[Prev in Thread] Current Thread [Next in Thread]