bug-gnustep
[Top][All Lists]
Advanced

[Date Prev][Date Next][Thread Prev][Thread Next][Date Index][Thread Index]

GNUstep Back failed


From: Burton, Craig
Subject: GNUstep Back failed
Date: Mon, 29 Aug 2005 15:05:19 -0700

Hello again.

Adam's suggestion to look into the compile latency helped - the build got farther this time.  However, the library that was not opened *does* exist in the GNUstep tree.  Do I need to set my shared lib path to include the installation directory?





Making all for bundle libgnustep-back-010...
 Creating libgnustep-back-010.bundle/Resources/Info-gnustep.plist...
ld.so.1: plmerge: fatal: libgnustep-base.so.1.11: open failed: No such file or directory
Killed
make[2]: *** [libgnustep-back-010.bundle/Resources/Info-gnustep.plist] Error 137
make[1]: *** [libgnustep-back-010.all.bundle.variables] Error 2
make[1]: Leaving directory `/export/workspace/gnustep/gnustep-startup-0.12.0/build/gnustep-back-0.10.0/Source'
make: *** [internal-all] Error 2
---------------------------------------------------------
Installation of GNUstep Back failed. Send the /export/workspace/gnustep/gnustep-startup-0.12.0/build/logs.tar.gz
file to address@hidden for help



Attached please find the build logs.






<<logs.tar.gz>>

Thank you,
Craig


Craig Burton
Software Engineer
VeriSign Communication Services
2125-A
360.923.3475

2249662074686520636F6D7075746572277320776F726B696E672C2049276D20776F726B696E672E22

Attachment: logs.tar.gz
Description: logs.tar.gz


reply via email to

[Prev in Thread] Current Thread [Next in Thread]