[Top][All Lists]

[Date Prev][Date Next][Thread Prev][Thread Next][Date Index][Thread Index]

[bug #15147] compile error

From: YunSong Hwang
Subject: [bug #15147] compile error
Date: Mon, 5 Dec 2005 12:35:25 +0000
User-agent: Mozilla/5.0 (X11; U; Linux i686; ko; rv:1.8) Gecko/20051205 Haansoft/1.5-2hs Firefox/1.5


                 Summary: compile error
                 Project: GNUstep
            Submitted by: hys545
            Submitted on: 월 2005년 12월 05일   12:35
                Category: Base/Foundation
                Severity: 3 - Normal
              Item Group: Bug
                  Status: None
                 Privacy: Public
             Assigned to: None
             Open/Closed: Open



I update cvs-2005-12-5

make[2]: Leaving directory
Making all for library libgnustep-base...
 Compiling file NSFileHandle.m ...
In file included from NSFileHandle.m:33:
../Headers/Foundation/NSPathUtilities.h:43: error: syntax error before '*'
../Headers/Foundation/NSPathUtilities.h:43: warning: type defaults to 'int'
in declaration of 'GNUstepConfig'
../Headers/Foundation/NSPathUtilities.h:43: warning: data definition has no
type or storage class
make[2]: *** [shared_obj/NSFileHandle.o] Error 1
make[1]: *** [libgnustep-base.all.library.variables] Error 2
make[1]: Leaving directory
make: *** [internal-all] Error 2


Reply to this item at:


  Message sent via/by Savannah

reply via email to

[Prev in Thread] Current Thread [Next in Thread]