[Top][All Lists]

[Date Prev][Date Next][Thread Prev][Thread Next][Date Index][Thread Index]

Current CVS - mkstemp problem

From: Borsenkow Andrej
Subject: Current CVS - mkstemp problem
Date: Wed, 5 Sep 2001 16:00:51 +0400

Yeah, our compiler is really picky ...



CC -I. -I/u3/u1/src/groff/src/libs/libgroff
-I/u3/u1/build/groff/src/include -I/u3/u1/src/groff/src/include
-Duintmax_t=unsigned\ long\ long -DRETSIGTYPE=void
/u3/u1/src/groff/src/libs/libgroff/tmpfile.cc   158: [error]:   CFE1308
more than one instance of overloaded function "mkstemp" matches the
argument list:
            function "mkstemp(char *)"
            function "std::mkstemp(char *)"
            argument types are: (char *)
    int fd = mkstemp(templ);
gmake[2]: *** [tmpfile.o] Error 1
gmake[2]: Leaving directory `/u3/u1/build/groff/src/libs/libgroff'
gmake[1]: *** [src/libs/libgroff] Error 2
gmake[1]: Leaving directory `/u3/u1/build/groff'
gmake: *** [all] Error 2

reply via email to

[Prev in Thread] Current Thread [Next in Thread]