[Top][All Lists]

[Date Prev][Date Next][Thread Prev][Thread Next][Date Index][Thread Index]

guile 1.5.6 test failure: syncase

From: Paul Jarc
Subject: guile 1.5.6 test failure: syncase
Date: Fri, 31 May 2002 12:51:50 -0400
User-agent: Gnus/5.090007 (Oort Gnus v0.07) Emacs/21.2 (i686-pc-linux-gnu)

I'm building guile 1.5.6, and I get this error from "make check":

make[1]: Entering directory `/fs/home/mount/home/prj/src/sptools/guile-1.5.6'
make  check-TESTS
make[2]: Entering directory `/fs/home/mount/home/prj/src/sptools/guile-1.5.6'
Testing /home/prj/src/sptools/guile-1.5.6/pre-inst-guile ...
with GUILE_LOAD_PATH=/home/prj/src/sptools/guile-1.5.6/test-suite
FAIL: syncase.test: (ice-9 syncase) loads

Totals for this test run:
passes:                 2115
failures:               1
unexpected passes:      0
expected failures:      17
unresolved test cases:  0
untested test cases:    0
unsupported test cases: 9
errors:                 0

FAIL: check-guile
1 of 1 tests failed
make[2]: *** [check-TESTS] Error 1
make[2]: Leaving directory `/fs/home/mount/home/prj/src/sptools/guile-1.5.6'
make[1]: *** [check-am] Error 2
make[1]: Leaving directory `/fs/home/mount/home/prj/src/sptools/guile-1.5.6'
make: *** [check-recursive] Error 1

How can I go about investigating this?


reply via email to

[Prev in Thread] Current Thread [Next in Thread]