[Top][All Lists]

[Date Prev][Date Next][Thread Prev][Thread Next][Date Index][Thread Index]

guile 1.6.3 documentation installation problem, Solaris 8, gcc 3.2.1

From: Andrew Koenig
Subject: guile 1.6.3 documentation installation problem, Solaris 8, gcc 3.2.1
Date: Sun, 2 Feb 2003 23:19:46 -0500 (EST)

Under Solaris 8 (aka 2.8) with gcc 3.2.1, guile 1.6.3 appears to
build OK, but fails while making the documentation.

The relevant part of the installation output follows.  Apparently
snarf-check-and-output-texi is returning an error code without
otherwise complaining.  Suggestions welcome.


                                        Andrew Koenig


creating libguile.la
(cd .libs && rm -f libguile.la && ln -s ../libguile.la libguile.la)
/bin/bash ../libtool --mode=link gcc  -g -O2 -Wall -Wmissing-prototypes   -o 
guile -dlpreopen force guile.o libguile.la -lcrypt -lsocket -lnsl -lm 
libtool: link: warning: `AC_LIBTOOL_DLOPEN' not used. Assuming no dlopen 
rm -f .libs/guile.nm .libs/guile.nmS .libs/guile.nmT
creating .libs/guileS.c
(cd .libs && gcc -c -fno-builtin -fno-rtti -fno-exceptions "guileS.c")
rm -f .libs/guileS.c .libs/guile.nm .libs/guile.nmS .libs/guile.nmT
gcc -g -O2 -Wall -Wmissing-prototypes -o .libs/guile .libs/guileS.o guile.o 
-Wl,--export-dynamic  ./.libs/libguile.so 
/tmp/build-gnu5877/guile-1.6.3/libguile-ltdl/.libs/libguile-ltdl.so -ldl 
-lcrypt -lsocket -lnsl -lm -Wl,--rpath -Wl,/usr/gnu/lib
creating guile
cat alist.doc arbiters.doc async.doc backtrace.doc boolean.doc chars.doc 
continuations.doc debug.doc dynl.doc dynwind.doc environments.doc eq.doc 
error.doc eval.doc evalext.doc extensions.doc feature.doc fluids.doc fports.doc 
gc.doc goops.doc gsubr.doc guardians.doc hash.doc hashtab.doc hooks.doc 
init.doc ioext.doc iselect.doc keywords.doc lang.doc list.doc load.doc 
macros.doc mallocs.doc modules.doc numbers.doc objects.doc objprop.doc 
options.doc pairs.doc ports.doc print.doc procprop.doc procs.doc properties.doc 
random.doc rdelim.doc read.doc root.doc rw.doc scmsigs.doc script.doc 
simpos.doc smob.doc sort.doc srcprop.doc stackchk.doc stacks.doc stime.doc 
strings.doc strop.doc strorder.doc strports.doc struct.doc symbols.doc 
throw.doc values.doc variable.doc vectors.doc version.doc vports.doc weaks.doc 
symbols-deprecated.doc ramap.doc unif.doc filesys.doc posix.doc net_db.doc 
socket.doc regex-posix.doc inet_aton.doc | 
GUILE="/tmp/build-gnu5877/guile-1.6.3/pre-inst-guile" ..!
/scripts/snarf-check-and-output-texi --manual > guile.texi || { rm guile.texi; 
false; }
make[2]: *** [guile.texi] Error 1
make[2]: Leaving directory `/tmp/build-gnu5877/guile-1.6.3/libguile'
make[1]: *** [all-recursive] Error 1
make[1]: Leaving directory `/tmp/build-gnu5877/guile-1.6.3'
make: *** [all] Error 2

reply via email to

[Prev in Thread] Current Thread [Next in Thread]