[Top][All Lists]

[Date Prev][Date Next][Thread Prev][Thread Next][Date Index][Thread Index]

Problem building guile 1.6.7 on Solaris 2.8 with cc

From: Ivor Williams
Subject: Problem building guile 1.6.7 on Solaris 2.8 with cc
Date: Wed, 02 Nov 2005 09:18:23 -0500

Here's the tail of the output:

gmake[2]: Leaving directory `/vobs/tools/3rd-party/CPAN/bld/guile/libguile-ltdl'
Making all in libguile
gmake[2]: Entering directory `/vobs/tools/3rd-party/CPAN/bld/guile/libguile'
cat alist.doc arbiters.doc async.doc backtrace.doc boolean.doc chars.doc 
continuations.doc debug.doc dynl.doc dynwind.doc environments.doc eq.doc 
error.doc eval.doc evalext.doc extensions.doc feature.doc fluids.doc fports.doc 
gc.doc goops.doc gsubr.doc guardians.doc hash.doc hashtab.doc hooks.doc 
init.doc ioext.doc iselect.doc keywords.doc lang.doc list.doc load.doc 
macros.doc mallocs.doc modules.doc numbers.doc objects.doc objprop.doc 
options.doc pairs.doc ports.doc print.doc procprop.doc procs.doc properties.doc 
random.doc rdelim.doc read.doc root.doc rw.doc scmsigs.doc script.doc 
simpos.doc smob.doc sort.doc srcprop.doc stackchk.doc stacks.doc stime.doc 
strings.doc strop.doc strorder.doc strports.doc struct.doc symbols.doc 
throw.doc values.doc variable.doc vectors.doc version.doc vports.doc weaks.doc 
symbols-deprecated.doc ramap.doc unif.doc filesys.doc posix.doc net_db.doc 
socket.doc regex-posix.doc inet_aton.doc | 
../scripts/snarf-check-and-output-texi --manual > guile.texi || { rm 
guile.texi; false; }
ERROR: no code for module (ice-9 match)
gmake[2]: *** [guile.texi] Error 1
gmake[2]: Leaving directory `/vobs/tools/3rd-party/CPAN/bld/guile/libguile'
gmake[1]: *** [all-recursive] Error 1
gmake[1]: Leaving directory `/vobs/tools/3rd-party/CPAN/bld/guile'
gmake: *** [all] Error 2

Any help would be appreciated,


reply via email to

[Prev in Thread] Current Thread [Next in Thread]