[Top][All Lists]

[Date Prev][Date Next][Thread Prev][Thread Next][Date Index][Thread Index]

bug#12719: error when using make check

From: Areth Unknown
Subject: bug#12719: error when using make check
Date: Wed, 24 Oct 2012 14:01:52 +0200

OS: Mac OS 10.5.8
guile: v2.0.6-46-gead2496
libatomic_ops: libatomic_ops-7_3alpha2-80-g94c0b20
libgc: gc7_3alpha2-132-ge03d9eclibffi-3.0.11
gmp: 5.0.5
libunistring: 0.9.3
libtool: 2.4.2
libiconv: 1.14
readline: 6.2.000

I think that should be it.

Running srfi-1.test
Running srfi-10.test
Running srfi-11.test
Running srfi-13.test
Running srfi-14.test
Running srfi-17.test
Running srfi-18.test
Assertion failed: (scm_is_eq (m->owner, t->handle)), function do_thread_exit, file threads.c, line 700.
/bin/sh: line 1: 16394 Abort trap              CHARSETALIASDIR="/Users/paw/guile/lib" ${dir}$tst
FAIL: check-guile
1 of 1 test failed
Please report to address@hidden
make[3]: *** [check-TESTS] Error 1
make[2]: *** [check-am] Error 2
make[1]: *** [check-recursive] Error 1
make: *** [check] Error 2

// add

reply via email to

[Prev in Thread] Current Thread [Next in Thread]