[Top][All Lists]

[Date Prev][Date Next][Thread Prev][Thread Next][Date Index][Thread Index]

Re: guix-package error while installing "make" package

From: Alen Skondro
Subject: Re: guix-package error while installing "make" package
Date: Tue, 01 Jan 2013 22:51:01 +0100
User-agent: Mozilla/5.0 (X11; Linux x86_64; rv:17.0) Gecko/17.0 Thunderbird/17.0

On 12/30/2012 09:34 PM, Ludovic Courtès wrote:
address@hidden (Ludovic Courtès) skribis:

And another question is, do I need to have the nix package installed
or is guix now a standalone component?

It’s now standalone.

I should point out that it lacks a command-line interface for some
functionality, such as the garbage collector.  But the functionality is
there, so it’s really a matter of writing the command-line tool that
invokes it.



Currently it fails in the guile package.

I attached the full log in case you need it.


Totals for this test run:
passes:                 34487
failures:               1
unexpected passes:      0
expected failures:      30
unresolved test cases:  566
untested test cases:    1
unsupported test cases: 9
errors:                 0

WARNING: (test-suite sxml-xpath): imported module (sxml xpath) overrides core binding `filter'
FAIL: check-guile
1 of 1 test failed
Please report to address@hidden
make[3]: *** [check-TESTS] Error 1
make[3]: Leaving directory `/tmp/nix-build-guile-2.0.6.drv-0/guile-2.0.6'
make[2]: *** [check-am] Error 2
make[2]: Leaving directory `/tmp/nix-build-guile-2.0.6.drv-0/guile-2.0.6'
make[1]: *** [check-recursive] Error 1
make[1]: Leaving directory `/tmp/nix-build-guile-2.0.6.drv-0/guile-2.0.6'
make: *** [check] Error 2
| | building of `/nix/store/8vg4zka7qad0r4qlh725xn44bbnfz2bw-guile-2.0.6.drv': got EOF | | building of `/nix/store/8vg4zka7qad0r4qlh725xn44bbnfz2bw-guile-2.0.6.drv': woken up | | building of `/nix/store/8vg4zka7qad0r4qlh725xn44bbnfz2bw-guile-2.0.6.drv': build done | | builder process for `/nix/store/8vg4zka7qad0r4qlh725xn44bbnfz2bw-guile-2.0.6.drv' finished
|   |   recursively deleting path `/tmp/nix-build-guile-2.0.6.drv-0'
| | builder for `/nix/store/8vg4zka7qad0r4qlh725xn44bbnfz2bw-guile-2.0.6.drv' failed with exit code 1 | | lock released on `/nix/store/bpmmxlsg7ask9vffhyv6qzxl157w6zx2-guile-2.0.6.lock' | | building of `/nix/store/8vg4zka7qad0r4qlh725xn44bbnfz2bw-guile-2.0.6.drv': done | recursively deleting path `/nix/store/8vg4zka7qad0r4qlh725xn44bbnfz2bw-guile-2.0.6.drv.chroot' | building of `/nix/store/8vg4zka7qad0r4qlh725xn44bbnfz2bw-guile-2.0.6.drv': goal destroyed error: build failed: build of `/nix/store/8vg4zka7qad0r4qlh725xn44bbnfz2bw-guile-2.0.6.drv' failed

Attachment: guile-test-failure.log
Description: Text Data

reply via email to

[Prev in Thread] Current Thread [Next in Thread]